program: Orca
programVersion: 5.0.4
elementType: S S P O O O N N N C C C C C C C C C C C C H H H H H H H H H H H H H H H H
charge: 0
multiplicity: 1
keywords: wb97x-d3
keywords: def2-TZVPP
keywords: def2/J RIJCOSX
keywords: DEFGRID2
keywords: scfconv7
keywords: smallprint printgap noloewdin
keywords: NOSOSCF
formula: C12H16N3O3PS2
InChI: InChI=1/C12H16N3O3PS2/c1-3-17-19(20,18-4-2)21-9-15-12(16)10-7-5-6-8-11(10)13-14-15/h5-8H,3-4,9H2,1-2H3
37 atoms
S  1.654684 1.965732 -0.651404
S  3.790063 -0.358932 0.332144
P  2.034209 -0.066342 -0.394793
O  1.723143 -0.638861 -1.849909
O  0.806171 -0.635924 0.466581
O  -1.251156 2.713128 0.682056
N  -0.979031 1.222968 -1.000085
N  -1.257348 0.080049 -1.652247
N  -2.086223 -0.728835 -1.198676
C  0.081867 1.988229 -1.598484
C  -2.503806 0.691916 0.723246
C  -1.553194 1.646329 0.186705
C  -2.728023 -0.479078 -0.001128
C  -3.167488 0.908568 1.930751
C  -3.623357 -1.439008 0.475639
C  2.09444 -1.973774 -2.257872
C  0.888262 -0.899694 1.881462
C  -4.045626 -0.045854 2.39838
C  -4.273409 -1.218323 1.669838
C  1.297621 -3.055597 -1.571327
C  0.905354 0.351602 2.723813
H  0.243949 1.610143 -2.603286
H  -0.187366 3.041735 -1.660179
H  -2.990047 1.815191 2.493708
H  -3.789236 -2.341446 -0.097968
H  1.914133 -1.985555 -3.331437
H  3.166193 -2.110149 -2.09669
H  0.007114 -1.501683 2.099226
H  1.769587 -1.511783 2.081899
H  -4.564028 0.11109 3.334837
H  -4.966427 -1.957841 2.04852
H  1.524817 -4.008206 -2.052133
H  1.551149 -3.156983 -0.515928
H  0.224407 -2.884976 -1.661339
H  0.890244 0.05976 3.775082
H  1.806257 0.943999 2.562577
H  0.035965 0.982718 2.543556
elementType: S P O N C H
totalener: -1994.76674256 hartree
nucrepener: 2357.48592803 hartree
electener: -4352.25267058 hartree
oneelecener: -7431.83186764 hartree
twoeener: 3079.57919706 hartree
cpcmener: -0.02835439 hartree
kineticenergy: 1989.07423801 hartree
xcener: -136.741487969143 hartree
chargesum: -0.0000000
charge: -0.141124 -0.433683 0.606979 -0.327929 -0.326318 -0.460189 0.070841 -0.111453 -0.147134 -0.042485 0.019581 0.300472 0.079603 -0.146614 -0.184352 0.014819 0.031956 -0.112979 -0.104799 -0.236165 -0.247458 0.149668 0.162587 0.152022 0.146335 0.108081 0.095431 0.106825 0.108508 0.164052 0.162729 0.102809 0.081423 0.084554 0.106414 0.080583 0.086411
qa: -0.1411 -0.4337 0.6070 -0.3279 -0.3263 -0.4602 0.0708 -0.1115 -0.1471 -0.0425 0.0196 0.3005 0.0796 -0.1466 -0.1844 0.0148 0.0320 -0.1130 -0.1048 -0.2362 -0.2475 0.1497 0.1626 0.1520 0.1463 0.1081 0.0954 0.1068 0.1085 0.1641 0.1627 0.1028 0.0814 0.0846 0.1064 0.0806 0.0864
va: 2.2664 2.0387 5.4409 2.1048 2.0518 2.0601 3.2302 2.8376 2.9790 3.9105 3.4388 4.2407 3.9664 3.9233 4.0054 3.8768 3.8076 3.9194 3.9273 3.8957 3.9174 1.0196 0.9958 1.0174 1.0158 0.9904 1.0089 0.9911 1.0131 0.9888 0.9877 1.0107 1.0117 1.0107 1.0118 1.0214 1.0075
dispcorr: -0.023361139 hartree
energy: -1994.790103694475
dipole: -4.90515 2.40911 -2.49603 -13.08917 11.52388 -1.56529 6.89841 -6.41841 0.48000
magnitude: 2.98509 au
magnitude: 7.58748 debye
