program: Orca
programVersion: 5.0.4
elementType: S S P O O O N N N C C C C C C C C C C C C H H H H H H H H H H H H H H H H
charge: 0
multiplicity: 1
keywords: wb97x-d3
keywords: def2-TZVPP
keywords: def2/J RIJCOSX
keywords: DEFGRID2
keywords: scfconv7
keywords: smallprint printgap noloewdin
keywords: NOSOSCF
formula: C12H16N3O3PS2
InChI: InChI=1/C12H16N3O3PS2/c1-3-17-19(20,18-4-2)21-9-15-12(16)10-7-5-6-8-11(10)13-14-15/h5-8H,3-4,9H2,1-2H3
37 atoms
S  1.46887 1.544303 -1.364956
S  3.434755 0.975208 1.219693
P  1.962114 0.264971 0.207976
O  2.136937 -1.200526 -0.410582
O  0.556534 0.141361 0.952482
O  -0.93254 -1.681087 -1.174033
N  -1.085139 0.568281 -1.48587
N  -1.668587 1.76558 -1.301208
N  -2.656253 1.89192 -0.556609
C  0.136333 0.652913 -2.246977
C  -2.625802 -0.476068 -0.032028
C  -1.490405 -0.632286 -0.92219
C  -3.165115 0.800281 0.122288
C  -3.151149 -1.551527 0.683458
C  -4.238495 1.00996 0.990024
C  3.412029 -1.747165 -0.795727
C  0.414959 -0.382315 2.290558
C  -4.202505 -1.335295 1.54976
C  -4.74631 -0.055644 1.700844
C  3.975654 -1.116853 -2.044911
C  0.655512 -1.868823 2.379858
H  0.461559 -0.340396 -2.538462
H  -0.035915 1.23808 -3.149501
H  -2.729143 -2.540426 0.565816
H  -4.648307 2.005573 1.09594
H  4.109686 -1.65375 0.039031
H  3.215733 -2.8070 -0.952309
H  1.0810 0.166431 2.959957
H  -0.610271 -0.139319 2.566239
H  -4.613513 -2.161533 2.114013
H  -5.575108 0.097153 2.3792
H  4.251295 -0.073414 -1.892326
H  4.880649 -1.65629 -2.327977
H  3.277719 -1.176997 -2.880109
H  1.703181 -2.131414 2.235308
H  0.370091 -2.204685 3.377609
H  0.05275 -2.419069 1.657347
elementType: S P O N C H
totalener: -1994.76707737 hartree
nucrepener: 2328.27474798 hartree
electener: -4323.04182535 hartree
oneelecener: -7373.61781227 hartree
twoeener: 3050.57598692 hartree
cpcmener: -0.02987637 hartree
kineticenergy: 1989.07647303 hartree
xcener: -136.741699061766 hartree
chargesum: -0.0000000
charge: -0.137881 -0.430940 0.605771 -0.326090 -0.326357 -0.465557 0.080005 -0.106336 -0.144651 -0.039728 0.010779 0.273895 0.096887 -0.152827 -0.182385 0.038625 0.009552 -0.119508 -0.099308 -0.246961 -0.239077 0.145783 0.162810 0.154904 0.145788 0.094382 0.108672 0.109924 0.103361 0.164200 0.163270 0.077234 0.102727 0.093721 0.087002 0.103785 0.084526
qa: -0.1379 -0.4309 0.6058 -0.3261 -0.3264 -0.4656 0.0800 -0.1063 -0.1447 -0.0397 0.0108 0.2739 0.0969 -0.1528 -0.1824 0.0386 0.0096 -0.1195 -0.0993 -0.2470 -0.2391 0.1458 0.1628 0.1549 0.1458 0.0944 0.1087 0.1099 0.1034 0.1642 0.1633 0.0772 0.1027 0.0937 0.0870 0.1038 0.0845
va: 2.2721 2.0417 5.4344 2.0668 2.0901 2.0498 3.2269 2.8291 3.0015 3.9083 3.4077 4.2926 3.9869 3.9244 4.0119 3.8389 3.8595 3.9314 3.9236 3.9186 3.8953 1.0263 1.0030 1.0136 1.0174 1.0124 0.9908 1.0103 0.9891 0.9889 0.9873 1.0160 1.0126 1.0018 1.0146 1.0096 1.0100
dispcorr: -0.022313618 hartree
energy: -1994.789390986919
dipole: 3.17013 -4.85414 -1.68401 -15.47040 13.65276 -1.81763 4.95019 -4.54866 0.40153
magnitude: 2.51016 au
magnitude: 6.38032 debye
