program: Orca
programVersion: 5.0.4
elementType: S S P O O O N N N C C C C C C C C C C C C H H H H H H H H H H H H H H H H
charge: 0
multiplicity: 1
keywords: wb97x-d3
keywords: def2-TZVPP
keywords: def2/J RIJCOSX
keywords: DEFGRID2
keywords: scfconv7
keywords: smallprint printgap noloewdin
keywords: NOSOSCF
formula: C12H16N3O3PS2
InChI: InChI=1/C12H16N3O3PS2/c1-3-17-19(20,18-4-2)21-9-15-12(16)10-7-5-6-8-11(10)13-14-15/h5-8H,3-4,9H2,1-2H3
37 atoms
S  1.592204 0.490378 -1.827367
S  3.623622 -0.85216 0.358096
P  1.920325 0.022479 0.182553
O  0.624342 -0.763748 0.688712
O  1.665713 1.366464 1.002993
O  -1.425655 -0.509701 -2.56628
N  -0.979263 1.087251 -1.025995
N  -1.193647 1.735157 0.134362
N  -2.057311 1.338501 0.935766
C  0.131588 1.601276 -1.780705
C  -2.657683 -0.497913 -0.531639
C  -1.66922 -0.023773 -1.480313
C  -2.806098 0.210883 0.660404
C  -3.429167 -1.634392 -0.773132
C  -3.73167 -0.209626 1.617578
C  0.589454 -2.199225 0.824195
C  2.59097 2.470838 0.915768
C  -4.336414 -2.048105 0.179051
C  -4.487237 -1.334971 1.373139
C  0.540487 -2.922366 -0.49828
C  3.363855 2.604047 2.20274
H  -0.140137 1.745903 -2.8255
H  0.406275 2.562767 -1.356993
H  -3.311439 -2.184394 -1.697066
H  -3.83697 0.353763 2.53539
H  1.448787 -2.523971 1.413451
H  -0.308247 -2.395775 1.408216
H  3.267761 2.345333 0.066758
H  1.985754 3.356731 0.724607
H  -4.937529 -2.929958 0.003294
H  -5.204352 -1.67067 2.110441
H  1.447355 -2.771514 -1.083813
H  0.451427 -3.992016 -0.304171
H  -0.316486 -2.62308 -1.100219
H  3.98027 1.725394 2.391142
H  4.02341 3.469924 2.136681
H  2.699567 2.754464 3.053846
elementType: S P O N C H
totalener: -1994.76692177 hartree
nucrepener: 2341.90146285 hartree
electener: -4336.66838463 hartree
oneelecener: -7400.72233144 hartree
twoeener: 3064.05394682 hartree
cpcmener: -0.02966840 hartree
kineticenergy: 1989.08574089 hartree
xcener: -136.743119825037 hartree
chargesum: -0.0000000
charge: -0.145375 -0.430615 0.598916 -0.329138 -0.327882 -0.459342 0.070245 -0.109096 -0.136765 -0.042583 0.015750 0.302055 0.065929 -0.147897 -0.175558 0.027853 0.042935 -0.113742 -0.106456 -0.248886 -0.233341 0.164972 0.153054 0.152805 0.145207 0.109097 0.107392 0.089076 0.101085 0.164039 0.162458 0.082782 0.106973 0.085825 0.074724 0.092626 0.090883
qa: -0.1454 -0.4306 0.5989 -0.3291 -0.3279 -0.4593 0.0702 -0.1091 -0.1368 -0.0426 0.0157 0.3021 0.0659 -0.1479 -0.1756 0.0279 0.0429 -0.1137 -0.1065 -0.2489 -0.2333 0.1650 0.1531 0.1528 0.1452 0.1091 0.1074 0.0891 0.1011 0.1640 0.1625 0.0828 0.1070 0.0858 0.0747 0.0926 0.0909
va: 2.2636 2.0346 5.4887 2.1002 2.1067 2.0617 3.2225 2.8208 3.0027 3.9066 3.4219 4.2411 4.0081 3.9193 4.0043 3.8188 3.8484 3.9210 3.9311 3.8943 3.9598 0.9981 1.0077 1.0175 1.0173 1.0141 0.9931 1.0067 0.9945 0.9889 0.9878 1.0212 1.0110 1.0104 1.0181 1.0072 1.0039
dispcorr: -0.022578550 hartree
energy: -1994.789500323941
dipole: 0.00465 -2.07347 -2.06882 -2.51814 2.69260 0.17446 7.48378 -6.79516 0.68862
magnitude: 2.18738 au
magnitude: 5.55988 debye
