program: Orca
programVersion: 5.0.4
elementType: S S P O O O N N N C C C C C C C C C C C C H H H H H H H H H H H H H H H H
charge: 0
multiplicity: 1
keywords: wb97x-d3
keywords: def2-TZVPP
keywords: def2/J RIJCOSX
keywords: DEFGRID2
keywords: scfconv7
keywords: smallprint printgap noloewdin
keywords: NOSOSCF
formula: C12H16N3O3PS2
InChI: InChI=1/C12H16N3O3PS2/c1-3-17-19(20,18-4-2)21-9-15-12(16)10-7-5-6-8-11(10)13-14-15/h5-8H,3-4,9H2,1-2H3
37 atoms
S  1.543188 0.39018 -2.035399
S  3.689342 -0.908265 0.132509
P  2.014888 0.023481 -0.041383
O  0.742483 -0.707186 0.609621
O  1.892202 1.486638 0.575372
O  -1.565693 -0.51519 -2.53494
N  -0.945142 1.108285 -1.083927
N  -1.048518 1.797193 0.068067
N  -1.874745 1.466543 0.936702
C  0.125304 1.552942 -1.935724
C  -2.658944 -0.379385 -0.42849
C  -1.712526 0.01631 -1.4529
C  -2.694384 0.370657 0.747072
C  -3.500636 -1.480613 -0.584462
C  -3.577798 0.028178 1.772789
C  0.666076 -2.133985 0.797368
C  2.016985 1.718552 1.997957
C  -4.36463 -1.817912 0.435497
C  -4.402782 -1.063032 1.612845
C  0.532263 -2.905587 -0.492126
C  3.329852 2.391818 2.301359
H  -0.216282 1.662828 -2.964144
H  0.462839 2.519467 -1.574543
H  -3.471878 -2.062207 -1.495936
H  -3.597745 0.622015 2.677006
H  1.540787 -2.466816 1.358137
H  -0.209631 -2.28094 1.427604
H  1.171492 2.350177 2.269689
H  1.921735 0.784574 2.55598
H  -5.019686 -2.671399 0.325705
H  -5.086899 -1.340111 2.403895
H  -0.337447 -2.595525 -1.070323
H  1.417663 -2.817209 -1.121275
H  0.407979 -3.962007 -0.250733
H  3.438665 3.326374 1.751075
H  3.37576 2.624627 3.365763
H  4.174394 1.746256 2.0624
elementType: S P O N C H
totalener: -1994.76696812 hartree
nucrepener: 2343.60415046 hartree
electener: -4338.37111858 hartree
oneelecener: -7403.98844231 hartree
twoeener: 3065.61732373 hartree
cpcmener: -0.02803389 hartree
kineticenergy: 1989.07753540 hartree
xcener: -136.740800499518 hartree
chargesum: 0.0000000
charge: -0.140945 -0.433754 0.615408 -0.329819 -0.336344 -0.459613 0.072548 -0.114875 -0.140101 -0.035616 0.018096 0.295977 0.071041 -0.143639 -0.178124 0.031347 0.038567 -0.116219 -0.104536 -0.249021 -0.230585 0.162836 0.148381 0.151984 0.146324 0.108129 0.105244 0.097206 0.093084 0.164299 0.162659 0.088471 0.079495 0.105974 0.088804 0.092579 0.074737
qa: -0.1409 -0.4338 0.6154 -0.3298 -0.3363 -0.4596 0.0725 -0.1149 -0.1401 -0.0356 0.0181 0.2960 0.0710 -0.1436 -0.1781 0.0313 0.0386 -0.1162 -0.1045 -0.2490 -0.2306 0.1628 0.1484 0.1520 0.1463 0.1081 0.1052 0.0972 0.0931 0.1643 0.1627 0.0885 0.0795 0.1060 0.0888 0.0926 0.0747
va: 2.2671 2.0366 5.4447 2.0584 2.0982 2.0604 3.2364 2.8274 2.9900 3.9051 3.4282 4.2455 3.9994 3.9245 4.0039 3.8183 3.8772 3.9228 3.9292 3.9035 3.9500 0.9961 1.0210 1.0178 1.0164 1.0143 0.9925 0.9970 0.9987 0.9890 0.9878 1.0087 1.0221 1.0121 1.0041 1.0078 1.0182
dispcorr: -0.022675188 hartree
energy: -1994.789643307387
dipole: -1.90119 -0.68892 -2.59011 -4.27735 4.09017 -0.18719 11.71638 -10.00241 1.71397
magnitude: 3.11150 au
magnitude: 7.90879 debye
