program: Orca
programVersion: 5.0.4
elementType: S S P O O O N N N C C C C C C C C C C C C H H H H H H H H H H H H H H H H
charge: 0
multiplicity: 1
keywords: wb97x-d3
keywords: def2-TZVPP
keywords: def2/J RIJCOSX
keywords: DEFGRID2
keywords: scfconv7
keywords: smallprint printgap noloewdin
keywords: NOSOSCF
formula: C12H16N3O3PS2
InChI: InChI=1/C12H16N3O3PS2/c1-3-17-19(20,18-4-2)21-9-15-12(16)10-7-5-6-8-11(10)13-14-15/h5-8H,3-4,9H2,1-2H3
37 atoms
S  1.004129 -1.738675 -0.479549
S  2.893204 0.815811 -1.746543
P  2.189916 -0.044185 -0.171281
O  3.25751 -0.638101 0.861709
O  1.248241 0.837462 0.768482
O  -2.287113 -2.27336 -0.479966
N  -1.259376 -0.360618 -1.121321
N  -1.118627 0.974996 -1.1579
N  -1.973356 1.720742 -0.645042
C  -0.167674 -1.08844 -1.713823
C  -3.295224 -0.189167 0.062045
C  -2.285183 -1.059261 -0.506134
C  -3.08855 1.18783 -0.026157
C  -4.436444 -0.692194 0.686016
C  -4.023475 2.07236 0.516351
C  4.57609 -1.070223 0.469468
C  1.394893 2.267559 0.883678
C  -5.358346 0.187289 1.212257
C  -5.14927 1.568077 1.129317
C  4.56618 -2.385911 -0.26919
C  2.650664 2.662388 1.621508
H  -0.543718 -1.949646 -2.261343
H  0.350395 -0.434768 -2.41346
H  -4.593298 -1.76055 0.75068
H  -3.85001 3.138018 0.445437
H  5.049407 -0.288928 -0.12807
H  5.126035 -1.155225 1.405361
H  1.364484 2.714618 -0.111753
H  0.505942 2.590176 1.423203
H  -6.249918 -0.191183 1.693884
H  -5.880775 2.245407 1.549599
H  5.596918 -2.698305 -0.442304
H  4.073982 -3.170045 0.306568
H  4.080617 -2.308131 -1.242424
H  2.717164 2.172965 2.593308
H  3.551299 2.432336 1.050762
H  2.63763 3.739785 1.790792
elementType: S P O N C H
totalener: -1994.76969804 hartree
nucrepener: 2255.57279561 hartree
electener: -4250.34249365 hartree
oneelecener: -7228.49268069 hartree
twoeener: 2978.15018703 hartree
cpcmener: -0.02689139 hartree
kineticenergy: 1989.08606104 hartree
xcener: -136.741803993202 hartree
chargesum: -0.0000000
charge: -0.142963 -0.445051 0.640017 -0.358446 -0.343822 -0.469904 0.069293 -0.113143 -0.156226 -0.046633 -0.007606 0.350747 0.093861 -0.139204 -0.187665 0.046364 0.029501 -0.121824 -0.100109 -0.253178 -0.237273 0.162026 0.152987 0.151450 0.146942 0.094064 0.109232 0.096783 0.109004 0.163977 0.163058 0.102141 0.093703 0.079356 0.091989 0.078462 0.098091
qa: -0.1430 -0.4451 0.6400 -0.3584 -0.3438 -0.4699 0.0693 -0.1131 -0.1562 -0.0466 -0.0076 0.3507 0.0939 -0.1392 -0.1877 0.0464 0.0295 -0.1218 -0.1001 -0.2532 -0.2373 0.1620 0.1530 0.1515 0.1469 0.0941 0.1092 0.0968 0.1090 0.1640 0.1631 0.1021 0.0937 0.0794 0.0920 0.0785 0.0981
va: 2.2871 1.9935 5.4157 2.0958 2.0932 2.0550 3.2411 2.8420 2.9824 3.8845 3.5205 4.2313 3.9965 3.9473 4.0070 3.8417 3.8367 3.9284 3.9219 3.9016 3.9254 1.0038 1.0334 1.0158 1.0162 1.0121 0.9912 1.0124 0.9911 0.9895 0.9877 1.0112 1.0027 1.0179 1.0064 1.0171 1.0080
dispcorr: -0.019126397 hartree
energy: -1994.788824440304
dipole: 10.77613 -11.71664 -0.94052 4.18759 -3.43260 0.75500 8.02883 -6.90966 1.11917
magnitude: 1.64534 au
magnitude: 4.18212 debye
