program: Orca
programVersion: 5.0.4
elementType: S S P O O O N N N C C C C C C C C C C C C H H H H H H H H H H H H H H H H
charge: 0
multiplicity: 1
keywords: wb97x-d3
keywords: def2-TZVPP
keywords: def2/J RIJCOSX
keywords: DEFGRID2
keywords: scfconv7
keywords: smallprint printgap noloewdin
keywords: NOSOSCF
formula: C12H16N3O3PS2
InChI: InChI=1/C12H16N3O3PS2/c1-3-17-19(20,18-4-2)21-9-15-12(16)10-7-5-6-8-11(10)13-14-15/h5-8H,3-4,9H2,1-2H3
37 atoms
S  1.740551 1.48806 -1.532169
S  3.852498 0.155003 0.629366
P  2.076146 0.020146 -0.091635
O  1.687789 -1.301475 -0.894385
O  0.878009 0.110101 0.971424
O  -1.263907 -1.370351 -1.858454
N  -0.929853 0.835199 -1.38767
N  -1.236458 1.978896 -0.753442
N  -2.110113 2.011254 0.131436
C  0.165647 0.981128 -2.315601
C  -2.539132 -0.359186 -0.13779
C  -1.5443 -0.393797 -1.192853
C  -2.781492 0.858805 0.494927
C  -3.237763 -1.502383 0.248621
C  -3.724905 0.944184 1.520336
C  1.554319 -2.567981 -0.210438
C  0.990519 0.796508 2.232548
C  -4.168053 -1.412171 1.262635
C  -4.410217 -0.189943 1.898264
C  1.640892 -3.669831 -1.231154
C  1.084711 2.296759 2.099147
H  0.299044 0.057109 -2.867231
H  -0.053207 1.777963 -3.02608
H  -3.050721 -2.448076 -0.242179
H  -3.902835 1.897068 2.001214
H  2.348455 -2.67039 0.533803
H  0.595211 -2.589362 0.309322
H  0.090715 0.51466 2.77806
H  1.849919 0.4021 2.778039
H  -4.716207 -2.292761 1.569707
H  -5.1429 -0.135397 2.692541
H  0.858612 -3.580615 -1.986003
H  2.610836 -3.684139 -1.729097
H  1.508107 -4.628605 -0.727626
H  1.088879 2.731429 3.099983
H  2.003422 2.61126 1.603734
H  0.2361 2.715651 1.56032
elementType: S P O N C H
totalener: -1994.76734625 hartree
nucrepener: 2338.58186553 hartree
electener: -4333.34921178 hartree
oneelecener: -7393.89356696 hartree
twoeener: 3060.54435518 hartree
cpcmener: -0.02762110 hartree
kineticenergy: 1989.06436818 hartree
xcener: -136.738244026109 hartree
chargesum: 0.0000000
charge: -0.136083 -0.429841 0.606674 -0.338197 -0.328609 -0.470768 0.077851 -0.113828 -0.149156 -0.041202 0.039906 0.303952 0.061023 -0.140140 -0.181764 0.020570 0.029400 -0.121684 -0.099935 -0.237443 -0.250421 0.144518 0.166144 0.152445 0.146749 0.107274 0.104068 0.106357 0.106223 0.164507 0.162975 0.086172 0.088840 0.087828 0.103468 0.077593 0.094535
qa: -0.1361 -0.4298 0.6067 -0.3382 -0.3286 -0.4708 0.0779 -0.1138 -0.1492 -0.0412 0.0399 0.3040 0.0610 -0.1401 -0.1818 0.0206 0.0294 -0.1217 -0.0999 -0.2374 -0.2504 0.1445 0.1661 0.1524 0.1467 0.1073 0.1041 0.1064 0.1062 0.1645 0.1630 0.0862 0.0888 0.0878 0.1035 0.0776 0.0945
va: 2.2728 2.0426 5.4444 2.0979 2.0529 2.0441 3.2315 2.8215 2.9529 3.9089 3.4858 4.2272 3.9828 3.9442 4.0083 3.8401 3.8217 3.9286 3.9225 3.9565 3.9082 1.0306 0.9975 1.0164 1.0161 1.0069 0.9955 0.9921 1.0134 0.9891 0.9877 1.0086 1.0051 1.0071 1.0128 1.0203 1.0076
dispcorr: -0.022442837 hartree
energy: -1994.789789091888
dipole: -5.07953 2.25038 -2.82916 -9.63406 8.70248 -0.93158 8.88183 -7.58593 1.29591
magnitude: 3.24828 au
magnitude: 8.25647 debye
