program: Orca
programVersion: 5.0.2
elementType: S S P O O O N N N C C C C C C C C C C C C H H H H H H H H H H H H H H H H
charge: 0
multiplicity: 1
keywords: wb97x-d3
keywords: def2-TZVPP
keywords: def2/J RIJCOSX
keywords: DEFGRID2
keywords: scfconv7
keywords: smallprint printgap noloewdin
keywords: NOSOSCF
formula: C12H16N3O3PS2
InChI: InChI=1/C12H16N3O3PS2/c1-3-17-19(20,18-4-2)21-9-15-12(16)10-7-5-6-8-11(10)13-14-15/h5-8H,3-4,9H2,1-2H3
37 atoms
S  1.100539 1.741256 0.275271
S  2.94692 -0.051134 -1.976654
P  2.313594 0.097254 -0.16782
O  1.43726 -1.114127 0.390983
O  3.430753 0.265984 0.969484
O  -2.21849 2.362508 0.348885
N  -1.167195 0.777827 -0.887789
N  -1.025529 -0.462487 -1.384017
N  -1.902582 -1.326496 -1.199608
C  -0.046987 1.64861 -1.134377
C  -3.24294 0.231524 0.099027
C  -2.213368 1.238714 -0.094184
C  -3.038715 -1.023885 -0.470074
C  -4.399749 0.495902 0.830325
C  -3.999301 -2.025866 -0.310921
C  1.661797 -2.46131 -0.054554
C  4.722242 0.824714 0.697428
C  -5.342924 -0.497319 0.982252
C  -5.140927 -1.758037 0.41097
C  0.66558 -3.356037 0.640938
C  4.679189 2.319506 0.4745
H  0.484443 1.294285 -2.016859
H  -0.40152 2.662228 -1.302078
H  -4.540153 1.47531 1.266509
H  -3.823863 -2.99377 -0.760232
H  1.540336 -2.505812 -1.138133
H  2.685746 -2.761982 0.182537
H  5.319918 0.578973 1.574587
H  5.161804 0.320524 -0.16616
H  -6.245623 -0.30299 1.545571
H  -5.889874 -2.528384 0.537562
H  0.830313 -4.38787 0.330002
H  0.772279 -3.309886 1.724121
H  -0.355683 -3.086695 0.375635
H  4.208663 2.837042 1.309956
H  5.696663 2.697872 0.372652
H  4.139885 2.571909 -0.43797
totalener: -1994.74679567 hartree
nucrepener: 2254.59354592 hartree
electener: -4249.34034159 hartree
oneelecener: -7225.68899596 hartree
twoeener: 2976.34865437 hartree
kineticenergy: 1989.14446540 hartree
xcener: -136.747299673717 hartree
chargesum: -0.0000000
charge: -0.119792 -0.400456 0.615781 -0.315886 -0.335032 -0.378678 0.049894 -0.089473 -0.142979 -0.072191 -0.055510 0.311068 0.070488 -0.117981 -0.165825 0.003139 0.025734 -0.101171 -0.076214 -0.230723 -0.245676 0.157201 0.149547 0.147023 0.132432 0.112225 0.105260 0.094774 0.091654 0.135361 0.134001 0.076302 0.085147 0.085579 0.090652 0.086832 0.087495
qa: -0.1198 -0.4005 0.6158 -0.3159 -0.3350 -0.3787 0.0499 -0.0895 -0.1430 -0.0722 -0.0555 0.3111 0.0705 -0.1180 -0.1658 0.0031 0.0257 -0.1012 -0.0762 -0.2307 -0.2457 0.1572 0.1495 0.1470 0.1324 0.1122 0.1053 0.0948 0.0917 0.1354 0.1340 0.0763 0.0851 0.0856 0.0907 0.0868 0.0875
va: 2.2925 2.0415 5.4258 2.1188 2.1193 2.1432 3.2156 2.8379 2.9874 3.9110 3.5953 4.2561 4.0318 3.9787 4.0244 3.8595 3.8861 3.9490 3.9443 3.9700 3.8876 1.0328 1.0059 1.0173 1.0237 1.0019 0.9946 0.9911 1.0146 1.0000 0.9980 1.0093 1.0051 1.0061 1.0037 1.0143 1.0209
dispcorr: -0.018966349 hartree
energy: -1994.765762021820
dipole: 6.51308 -7.23667 -0.72358 -7.39899 6.66378 -0.73521 5.54831 -4.98158 0.56673
magnitude: 1.17698 au
magnitude: 2.99165 debye
