program: Orca
programVersion: 5.0.2
elementType: S S P O O O N N N C C C C C C C C C C C C H H H H H H H H H H H H H H H H
charge: 0
multiplicity: 1
keywords: wb97x-d3
keywords: def2-TZVPP
keywords: def2/J RIJCOSX
keywords: DEFGRID2
keywords: scfconv7
keywords: smallprint printgap noloewdin
keywords: NOSOSCF
formula: C12H16N3O3PS2
InChI: InChI=1/C12H16N3O3PS2/c1-3-17-19(20,18-4-2)21-9-15-12(16)10-7-5-6-8-11(10)13-14-15/h5-8H,3-4,9H2,1-2H3
37 atoms
S  1.142852 1.579993 -0.091295
S  2.694508 -0.626442 -2.185775
P  2.301242 -0.150108 -0.365439
O  1.598462 -1.244584 0.550267
O  3.544874 0.254222 0.561368
O  -2.432093 2.479037 -0.472693
N  -1.234308 0.614471 -0.988608
N  -1.029336 -0.713083 -0.998074
N  -1.901046 -1.502076 -0.592484
C  -0.084007 1.372683 -1.415716
C  -3.385687 0.344901 -0.052322
C  -2.358369 1.273312 -0.497919
C  -3.106855 -1.018936 -0.115124
C  -4.611472 0.79211 0.4379
C  -4.057425 -1.946191 0.317676
C  1.465517 -2.617747 0.153866
C  4.566856 1.120153 0.052386
C  -5.546447 -0.12902 0.858318
C  -5.267159 -1.498038 0.799168
C  2.739274 -3.394748 0.392673
C  5.499997 1.465976 1.186696
H  0.385053 0.873985 -2.263855
H  -0.404376 2.368563 -1.706848
H  -4.811126 1.853951 0.481113
H  -3.821245 -3.000069 0.263782
H  0.643959 -3.001993 0.756465
H  1.163301 -2.669602 -0.893233
H  5.096518 0.613394 -0.757326
H  4.116649 2.026105 -0.364729
H  -6.50189 0.20695 1.23777
H  -6.009012 -2.2101 1.134816
H  2.573345 -4.447204 0.160318
H  3.545358 -3.038292 -0.248455
H  3.061909 -3.324739 1.430985
H  4.977884 1.99216 1.984848
H  5.962226 0.573406 1.606668
H  6.294758 2.115058 0.819374
totalener: -1994.74710164 hartree
nucrepener: 2229.33946131 hartree
electener: -4224.08656295 hartree
oneelecener: -7175.15139448 hartree
twoeener: 2951.06483153 hartree
kineticenergy: 1989.14321931 hartree
xcener: -136.747924473101 hartree
chargesum: -0.0000000
charge: -0.142677 -0.399762 0.624022 -0.317631 -0.325396 -0.380472 0.045795 -0.092233 -0.129965 -0.062326 -0.059658 0.317301 0.066645 -0.120166 -0.165611 0.032492 0.018187 -0.097837 -0.081705 -0.227873 -0.227312 0.155672 0.145093 0.147548 0.133310 0.096276 0.100252 0.098507 0.085070 0.135021 0.134199 0.081130 0.080744 0.087004 0.085149 0.084799 0.076409
qa: -0.1427 -0.3998 0.6240 -0.3176 -0.3254 -0.3805 0.0458 -0.0922 -0.1300 -0.0623 -0.0597 0.3173 0.0666 -0.1202 -0.1656 0.0325 0.0182 -0.0978 -0.0817 -0.2279 -0.2273 0.1557 0.1451 0.1475 0.1333 0.0963 0.1003 0.0985 0.0851 0.1350 0.1342 0.0811 0.0807 0.0870 0.0851 0.0848 0.0764
va: 2.2954 2.0388 5.4238 2.1177 2.1232 2.1435 3.2408 2.8462 3.0134 3.8801 3.5853 4.2526 4.0571 3.9814 4.0223 3.8499 3.8664 3.9471 3.9525 3.9308 3.9601 1.0389 1.0192 1.0177 1.0224 0.9949 1.0112 1.0062 1.0002 1.0000 0.9980 1.0101 1.0221 1.0058 1.0060 1.0060 1.0077
dispcorr: -0.018008126 hartree
energy: -1994.765109768139
dipole: 12.06050 -12.85706 -0.79657 -7.05130 6.50428 -0.54702 7.12080 -6.48268 0.63812
magnitude: 1.15799 au
magnitude: 2.94338 debye
