program: Orca
programVersion: 5.0.2
elementType: S S P O O O N N N C C C C C C C C C C C C H H H H H H H H H H H H H H H H
charge: 0
multiplicity: 1
keywords: wb97x-d3
keywords: def2-TZVPP
keywords: def2/J RIJCOSX
keywords: DEFGRID2
keywords: scfconv7
keywords: smallprint printgap noloewdin
keywords: NOSOSCF
formula: C12H16N3O3PS2
InChI: InChI=1/C12H16N3O3PS2/c1-3-17-19(20,18-4-2)21-9-15-12(16)10-7-5-6-8-11(10)13-14-15/h5-8H,3-4,9H2,1-2H3
37 atoms
S  1.120711 0.932503 -1.494077
S  3.621718 -1.208331 -1.158321
P  2.273023 -0.232172 -0.214109
O  1.139436 -1.044568 0.565758
O  2.800719 0.741925 0.956748
O  -1.998463 1.395486 -2.054779
N  -1.152224 1.100195 0.026101
N  -1.184929 0.63698 1.286149
N  -2.144432 -0.047411 1.686444
C  0.0420 1.824984 -0.318985
C  -3.233086 0.10503 -0.482467
C  -2.121368 0.91209 -0.954469
C  -3.191915 -0.349533 0.834267
C  -4.310423 -0.215047 -1.307246
C  -4.235362 -1.133061 1.333364
C  1.496114 -1.977721 1.59775
C  4.107051 1.326371 0.927245
C  -5.335344 -0.988525 -0.807442
C  -5.295715 -1.447391 0.513235
C  0.289239 -2.829058 1.907885
C  4.207687 2.479348 -0.045339
H  -0.219337 2.754191 -0.821897
H  0.575535 2.050517 0.600332
H  -4.324338 0.146142 -2.326338
H  -4.18704 -1.476371 2.357666
H  2.330747 -2.595874 1.25525
H  1.820411 -1.425863 2.482516
H  4.287828 1.661242 1.948686
H  4.844391 0.557261 0.686214
H  -6.175633 -1.244133 -1.438498
H  -6.106778 -2.054367 0.892762
H  0.547705 -3.552207 2.681664
H  -0.540812 -2.225678 2.273069
H  -0.039772 -3.382037 1.028612
H  4.079189 2.148338 -1.075364
H  3.466628 3.250193 0.165935
H  5.195272 2.934248 0.035438
totalener: -1994.74589842 hartree
nucrepener: 2258.31506899 hartree
electener: -4253.06096740 hartree
oneelecener: -7232.95374841 hartree
twoeener: 2979.89278100 hartree
kineticenergy: 1989.13773167 hartree
xcener: -136.745914635048 hartree
chargesum: -0.0000000
charge: -0.092549 -0.369467 0.590301 -0.312685 -0.335744 -0.376265 0.053423 -0.091630 -0.144189 -0.090956 -0.041913 0.306805 0.067427 -0.117934 -0.166874 0.018032 0.023504 -0.101212 -0.077926 -0.250435 -0.239401 0.156362 0.141415 0.146597 0.131567 0.093091 0.099242 0.095250 0.092613 0.135523 0.134609 0.080821 0.094521 0.088071 0.090449 0.080761 0.088798
qa: -0.0925 -0.3695 0.5903 -0.3127 -0.3357 -0.3763 0.0534 -0.0916 -0.1442 -0.0910 -0.0419 0.3068 0.0674 -0.1179 -0.1669 0.0180 0.0235 -0.1012 -0.0779 -0.2504 -0.2394 0.1564 0.1414 0.1466 0.1316 0.0931 0.0992 0.0953 0.0926 0.1355 0.1346 0.0808 0.0945 0.0881 0.0904 0.0808 0.0888
va: 2.2845 2.0966 5.4313 2.1260 2.0602 2.1466 3.2207 2.8395 2.9842 3.9399 3.5903 4.2496 4.0270 3.9812 4.0291 3.8654 3.8769 3.9473 3.9463 3.9604 3.9097 0.9987 1.0281 1.0171 1.0233 1.0073 0.9954 0.9906 1.0189 1.0000 0.9977 1.0106 1.0067 1.0055 1.0178 1.0031 1.0159
dispcorr: -0.019484387 hartree
energy: -1994.765382804286
dipole: 3.65276 -4.72512 -1.07236 -1.86180 1.99912 0.13731 10.72393 -9.41574 1.30818
magnitude: 1.69710 au
magnitude: 4.31370 debye
