program: Orca
programVersion: 5.0.2
elementType: S S P O O O N N N C C C C C C C C C C C C H H H H H H H H H H H H H H H H
charge: 0
multiplicity: 1
keywords: wb97x-d3
keywords: def2-TZVPP
keywords: def2/J RIJCOSX
keywords: DEFGRID2
keywords: scfconv7
keywords: smallprint printgap noloewdin
keywords: NOSOSCF
formula: C12H16N3O3PS2
InChI: InChI=1/C12H16N3O3PS2/c1-3-17-19(20,18-4-2)21-9-15-12(16)10-7-5-6-8-11(10)13-14-15/h5-8H,3-4,9H2,1-2H3
37 atoms
S  1.328542 1.85099 -1.384038
S  3.619307 -0.539216 -1.284853
P  2.091317 0.184861 -0.388771
O  0.837802 -0.810274 -0.20677
O  2.275697 0.718795 1.099906
O  -0.743261 1.021175 2.01982
N  -1.114713 1.529202 -0.172301
N  -1.799729 1.428034 -1.325348
N  -2.738406 0.620721 -1.446361
C  0.009022 2.428187 -0.258564
C  -2.436263 -0.146029 0.839891
C  -1.361338 0.820747 1.002991
C  -3.08034 -0.210261 -0.393162
C  -2.802678 -1.007035 1.872354
C  -4.099225 -1.142542 -0.601392
C  0.377305 -1.612335 -1.301312
C  3.173405 0.089066 2.025563
C  -3.805699 -1.928531 1.6586
C  -4.452733 -1.995527 0.420614
C  -0.372054 -2.800835 -0.748872
C  2.69976 -1.277586 2.464623
H  -0.316758 3.375234 -0.686116
H  0.402914 2.601579 0.737511
H  -2.290128 -0.945214 2.822438
H  -4.586817 -1.176672 -1.566077
H  -0.264199 -1.002989 -1.943941
H  1.229455 -1.941746 -1.901606
H  4.168231 0.031584 1.576801
H  3.218629 0.775142 2.870137
H  -4.095548 -2.60446 2.4517
H  -5.237517 -2.723786 0.265617
H  -0.745325 -3.407194 -1.574338
H  0.278789 -3.426613 -0.138958
H  -1.226583 -2.49928 -0.144374
H  2.74621 -2.001524 1.650651
H  3.344674 -1.641453 3.265147
H  1.677391 -1.236221 2.839405
totalener: -1994.74311714 hartree
nucrepener: 2344.58412052 hartree
electener: -4339.32723766 hartree
oneelecener: -7405.24126757 hartree
twoeener: 3065.91402990 hartree
kineticenergy: 1989.13736012 hartree
xcener: -136.748752304026 hartree
chargesum: -0.0000000
charge: -0.110869 -0.371646 0.576772 -0.302632 -0.298318 -0.370222 0.061908 -0.091787 -0.114107 -0.075842 -0.008065 0.246697 0.013495 -0.118033 -0.156829 -0.029326 0.000415 -0.091631 -0.081772 -0.204956 -0.222276 0.146636 0.151280 0.142093 0.134669 0.105440 0.117604 0.097401 0.094197 0.135836 0.135034 0.087526 0.089561 0.057247 0.075171 0.085513 0.093816
qa: -0.1109 -0.3716 0.5768 -0.3026 -0.2983 -0.3702 0.0619 -0.0918 -0.1141 -0.0758 -0.0081 0.2467 0.0135 -0.1180 -0.1568 -0.0293 0.0004 -0.0916 -0.0818 -0.2050 -0.2223 0.1466 0.1513 0.1421 0.1347 0.1054 0.1176 0.0974 0.0942 0.1358 0.1350 0.0875 0.0896 0.0572 0.0752 0.0855 0.0938
va: 2.2896 2.0974 5.4409 2.0493 2.1233 2.1455 3.1841 2.8137 3.0077 3.9252 3.4445 4.2828 4.0304 3.9551 4.0281 3.8508 3.9115 3.9368 3.9478 3.9297 3.8812 1.0042 1.0260 1.0209 1.0232 0.9923 1.0230 1.0098 0.9931 1.0000 0.9982 1.0110 1.0106 1.0149 1.0243 1.0122 1.0084
dispcorr: -0.023187120 hartree
energy: -1994.766304259404
dipole: -3.04554 1.55077 -1.49478 -16.45462 15.53599 -0.91863 10.23401 -9.18096 1.05305
magnitude: 2.04625 au
magnitude: 5.20116 debye
