program: Orca
programVersion: 5.0.2
elementType: S S P O O O N N N C C C C C C C C C C C C H H H H H H H H H H H H H H H H
charge: 0
multiplicity: 1
keywords: wb97x-d3
keywords: def2-TZVPP
keywords: def2/J RIJCOSX
keywords: DEFGRID2
keywords: scfconv7
keywords: smallprint printgap noloewdin
keywords: NOSOSCF
formula: C12H16N3O3PS2
InChI: InChI=1/C12H16N3O3PS2/c1-3-17-19(20,18-4-2)21-9-15-12(16)10-7-5-6-8-11(10)13-14-15/h5-8H,3-4,9H2,1-2H3
37 atoms
S  1.678262 1.962289 -0.654586
S  3.721408 -0.39996 0.506169
P  2.017559 -0.062003 -0.299798
O  1.725596 -0.678084 -1.7428
O  0.734708 -0.556877 0.542338
O  -1.264006 2.686469 0.544001
N  -0.930601 1.179448 -1.116619
N  -1.189303 0.031778 -1.771153
N  -2.003832 -0.790924 -1.317548
C  0.152988 1.941705 -1.677179
C  -2.451798 0.627554 0.603318
C  -1.527046 1.609641 0.062814
C  -2.643887 -0.550271 -0.11551
C  -3.118866 0.834869 1.809794
C  -3.511602 -1.530637 0.371973
C  2.067577 -2.028142 -2.088876
C  0.76881 -0.737222 1.964739
C  -3.967962 -0.139776 2.288187
C  -4.16357 -1.322436 1.567038
C  1.138376 -3.052639 -1.476422
C  0.878535 0.557843 2.738259
H  0.367988 1.531417 -2.658977
H  -0.122501 2.991426 -1.765716
H  -2.959874 1.756103 2.353812
H  -3.651025 -2.436692 -0.202178
H  2.004977 -2.054701 -3.175813
H  3.10599 -2.217921 -1.805545
H  -0.166478 -1.247602 2.195812
H  1.595148 -1.404255 2.221067
H  -4.488954 0.009768 3.224352
H  -4.834321 -2.079172 1.951712
H  1.274653 -3.135859 -0.398986
H  0.095095 -2.812379 -1.676782
H  1.353029 -4.029793 -1.910801
H  0.798739 0.338827 3.803703
H  1.839673 1.043593 2.57369
H  0.089725 1.261917 2.478911
totalener: -1994.74092302 hartree
nucrepener: 2374.21457078 hartree
electener: -4368.95549380 hartree
oneelecener: -7464.65371964 hartree
twoeener: 3095.69822584 hartree
kineticenergy: 1989.13126038 hartree
xcener: -136.748790123650 hartree
chargesum: 0.0000000
charge: -0.105510 -0.369439 0.577038 -0.307522 -0.320180 -0.362738 0.048237 -0.091895 -0.127370 -0.063531 -0.026025 0.242423 0.068504 -0.129582 -0.161586 0.004288 0.001379 -0.094297 -0.088546 -0.230265 -0.235387 0.144727 0.150375 0.148655 0.132967 0.093886 0.094010 0.090716 0.111016 0.136467 0.134929 0.075061 0.095475 0.089586 0.087999 0.090362 0.095770
qa: -0.1055 -0.3694 0.5770 -0.3075 -0.3202 -0.3627 0.0482 -0.0919 -0.1274 -0.0635 -0.0260 0.2424 0.0685 -0.1296 -0.1616 0.0043 0.0014 -0.0943 -0.0885 -0.2303 -0.2354 0.1447 0.1504 0.1487 0.1330 0.0939 0.0940 0.0907 0.1110 0.1365 0.1349 0.0751 0.0955 0.0896 0.0880 0.0904 0.0958
va: 2.2706 2.1028 5.4508 2.1164 2.0399 2.1527 3.2081 2.8410 2.9997 3.9385 3.4754 4.2821 4.0095 3.9526 4.0231 3.9098 3.8527 3.9415 3.9542 3.8971 3.8996 1.0172 0.9951 1.0181 1.0220 0.9918 1.0115 0.9891 1.0145 0.9992 0.9979 1.0137 1.0093 1.0131 1.0135 1.0262 1.0086
dispcorr: -0.024004726 hartree
energy: -1994.764927748100
dipole: -5.29183 3.59689 -1.69494 -12.46351 11.45097 -1.01254 7.14668 -6.84112 0.30556
magnitude: 1.99785 au
magnitude: 5.07814 debye
