program: Orca
programVersion: 5.0.2
elementType: S S P O O O N N N C C C C C C C C C C C C H H H H H H H H H H H H H H H H
charge: 0
multiplicity: 1
keywords: wb97x-d3
keywords: def2-TZVPP
keywords: def2/J RIJCOSX
keywords: DEFGRID2
keywords: scfconv7
keywords: smallprint printgap noloewdin
keywords: NOSOSCF
formula: C12H16N3O3PS2
InChI: InChI=1/C12H16N3O3PS2/c1-3-17-19(20,18-4-2)21-9-15-12(16)10-7-5-6-8-11(10)13-14-15/h5-8H,3-4,9H2,1-2H3
37 atoms
S  1.620224 0.286838 -2.050617
S  3.716805 -1.04162 0.165306
P  2.076251 -0.083594 -0.052876
O  0.770724 -0.78484 0.580413
O  1.953226 1.387966 0.552579
O  -1.522602 -0.478267 -2.521986
N  -0.828407 1.121638 -1.073172
N  -0.908926 1.8244 0.073097
N  -1.734079 1.519212 0.951752
C  0.261444 1.512216 -1.928386
C  -2.579532 -0.313874 -0.399544
C  -1.635635 0.052298 -1.442451
C  -2.57859 0.43894 0.772532
C  -3.455245 -1.388769 -0.545845
C  -3.458496 0.119197 1.809145
C  0.658082 -2.204688 0.737151
C  1.959624 1.615825 1.969109
C  -4.314837 -1.703899 0.484372
C  -4.314699 -0.949106 1.662169
C  0.532647 -2.946936 -0.575197
C  1.932948 3.10627 2.199249
H  -0.08416 1.630758 -2.954298
H  0.645977 2.45696 -1.557474
H  -3.447724 -1.96028 -1.463864
H  -3.446032 0.720277 2.708028
H  1.51818 -2.572386 1.301118
H  -0.234619 -2.342762 1.347166
H  1.083782 1.143288 2.417685
H  2.855737 1.163248 2.402416
H  -4.996326 -2.537492 0.382457
H  -4.996463 -1.20573 2.461848
H  1.447069 -2.879312 -1.163211
H  0.352014 -4.002379 -0.368655
H  -0.291982 -2.576809 -1.181938
H  2.80363 3.592263 1.760639
H  1.032365 3.547725 1.774763
H  1.937255 3.309478 3.270008
totalener: -1994.74335389 hartree
nucrepener: 2356.50162061 hartree
electener: -4351.24497450 hartree
oneelecener: -7429.16075041 hartree
twoeener: 3077.91577591 hartree
kineticenergy: 1989.14004511 hartree
xcener: -136.748723492934 hartree
chargesum: -0.0000000
charge: -0.104222 -0.362342 0.578192 -0.325945 -0.316041 -0.363137 0.056487 -0.107857 -0.111167 -0.060412 -0.021976 0.234001 0.056720 -0.125082 -0.159834 0.001764 0.004696 -0.096382 -0.086475 -0.235175 -0.234419 0.149433 0.144246 0.148940 0.133349 0.109913 0.089848 0.098946 0.104010 0.136559 0.135060 0.088558 0.087808 0.095753 0.086769 0.093345 0.076065
qa: -0.1042 -0.3623 0.5782 -0.3259 -0.3160 -0.3631 0.0565 -0.1079 -0.1112 -0.0604 -0.0220 0.2340 0.0567 -0.1251 -0.1598 0.0018 0.0047 -0.0964 -0.0865 -0.2352 -0.2344 0.1494 0.1442 0.1489 0.1333 0.1099 0.0898 0.0989 0.1040 0.1366 0.1351 0.0886 0.0878 0.0958 0.0868 0.0933 0.0761
va: 2.2727 2.1163 5.4588 2.0442 2.1101 2.1515 3.2094 2.8374 3.0087 3.9405 3.4768 4.2880 4.0452 3.9526 4.0245 3.8671 3.8622 3.9439 3.9550 3.8920 3.9525 0.9961 1.0158 1.0187 1.0228 1.0157 0.9913 0.9978 1.0072 0.9995 0.9980 1.0249 1.0143 1.0082 1.0051 1.0076 1.0100
dispcorr: -0.023180759 hartree
energy: -1994.766534651642
dipole: -5.51691 3.62473 -1.89217 -2.36735 2.32212 -0.04523 11.21583 -10.11751 1.09833
magnitude: 2.18831 au
magnitude: 5.56223 debye
