program: Orca
programVersion: 5.0.2
elementType: Cl S P O O O O O N N C C C C C C C C C H H H H H H H H H H
charge: 0
multiplicity: 1
keywords: wb97x-d3
keywords: def2-TZVPP
keywords: def2/J RIJCOSX
keywords: DEFGRID2
keywords: scfconv7
keywords: smallprint printgap noloewdin
keywords: NOSOSCF
formula: C9H10ClN2O5PS
InChI: InChI=1/C9H10ClN2O5PS/c1-15-18(14,16-2)19-5-12-8-7(17-9(12)13)3-6(10)4-11-8/h3-4H,5H2,1-2H3
29 atoms
Cl -4.801976 1.275793 -0.968604
S  1.407936 0.075186 2.266508
P  2.205864 1.053787 0.62254
O  -0.44728 -1.375934 -1.755466
O  2.974433 -0.020492 -0.266308
O  0.921167 1.338781 -0.269472
O  1.452172 -2.430687 -1.167123
O  2.99667 2.222979 1.06761
N  0.049307 -1.444124 0.402483
N  -1.887907 -0.251696 1.224375
C  -1.146412 -0.761499 0.281366
C  0.854499 -1.539711 1.578932
C  -1.433119 -0.730298 -1.07354
C  0.477383 -1.81054 -0.850009
C  -2.556145 -0.109272 -1.538059
C  -3.35102 0.451326 -0.534518
C  -2.9997 0.35967 0.802724
C  4.211127 -0.595316 0.175206
C  1.034696 1.901941 -1.588467
H  0.290691 -1.994566 2.391783
H  1.713655 -2.171017 1.370827
H  -2.810627 -0.054274 -2.587405
H  -3.633643 0.792597 1.564991
H  4.073029 -1.162552 1.096657
H  4.967209 0.172805 0.332541
H  4.541258 -1.268768 -0.610343
H  1.644789 2.804699 -1.579325
H  0.026452 2.157348 -1.90204
H  1.457526 1.179854 -2.284901
elementType: Cl S P O N C H
totalener: -2034.60345439 hartree
nucrepener: 2046.01462016 hartree
electener: -4080.61807455 hartree
oneelecener: -6869.40409773 hartree
twoeener: 2788.78602318 hartree
cpcmener: -0.04363318 hartree
kineticenergy: 2029.15245579 hartree
xcener: -133.585123077038 hartree
chargesum: 0.0000000
charge: -0.078503 -0.157881 0.816262 -0.247711 -0.326744 -0.333108 -0.436397 -0.640959 -0.079443 -0.359464 0.191164 -0.036271 0.198005 0.421440 -0.167156 0.137021 -0.039305 -0.115864 -0.114376 0.166599 0.153967 0.157219 0.130284 0.114257 0.131118 0.130629 0.136648 0.122499 0.126070
qa: -0.0785 -0.1579 0.8163 -0.2477 -0.3267 -0.3331 -0.4364 -0.6410 -0.0794 -0.3595 0.1912 -0.0363 0.1980 0.4214 -0.1672 0.1370 -0.0393 -0.1159 -0.1144 0.1666 0.1540 0.1572 0.1303 0.1143 0.1311 0.1306 0.1366 0.1225 0.1261
va: 1.2207 2.2555 5.5260 2.1950 2.0731 2.0770 2.0719 1.9863 3.2058 3.0719 4.0030 3.8881 3.8658 4.3195 4.0717 3.8042 4.1247 3.8377 3.8207 0.9953 1.0083 1.0057 1.0111 0.9875 0.9984 0.9896 0.9955 0.9875 0.9931
dispcorr: -0.017601079 hartree
energy: -2034.621055472170
dipole: 16.11360 -17.14136 -1.02776 -2.65640 1.38704 -1.26936 -1.57273 0.76169 -0.81104
magnitude: 1.82356 au
magnitude: 4.63511 debye
