program: Gaussian 09
title: 000064962
version: EM64L-G09RevD.01
frameworkgroup: C1[X(C4H3N5)]
method: RPBEPBE
basis: SDD
operation: Freq
keyword: #p
keyword: freq=noraman
keyword: PBEPBE/SDD
title: #p freq=noraman PBEPBE/SDD
converged: NO NO NO NO
title: Mulliken charges:
elementType: N N N N N C C C C H H H
charge: -0.014941 -0.336033 0.013240 0.045238 -0.003975 0.046361 -0.058215 -0.260301 -0.332313 0.267565 0.375862 0.257511
chargesum: 0.00000
title: Mulliken charges with hydrogens summed into heavy atoms:
elementType: N N N N N C C C C
charge: -0.014941 0.039829 0.013240 0.045238 -0.003975 0.046361 -0.058215 0.007264 -0.074803
polarizability: 1.03043089e+02 3.31920218e-01 7.63715557e+01 -4.57469350e-03 2.46067758e-03 3.08644798e+01
1716.lowfreq: -0.0008 -0.0006 0.0005 8.4539 13.1624 17.1463 221.0754 230.7200 422.9354
frequency: 221.0707 230.7046 422.9350 435.2994 543.7668 604.0307 635.2156 637.1937 756.9078 758.9663 808.1525 863.2377 908.8228 918.4753 956.8623 1053.3489 1084.5597 1104.9334 1183.4081 1256.1863 1308.7455 1327.1196 1354.2312 1419.2295 1432.5347 1485.0649 1554.2195 3147.8995 3178.0814 3596.4238
redmass: 6.9912 4.4469 4.3288 6.8264 10.9239 4.1709 8.9184 12.7316 8.5354 1.1253 5.7922 6.4736 1.5313 12.7877 1.5045 4.3375 6.5513 7.1591 5.8359 3.6805 5.4561 2.9142 1.7171 1.4900 1.7434 10.2091 7.7238 1.0936 1.0930 1.0838
irintensity: 0.8504 0.5126 0.7248 6.5095 1.9535 8.4734 2.6605 1.1094 5.5401 113.8081 8.3597 14.7051 25.1317 1.1607 0.3126 4.3703 36.9726 28.2069 0.9929 2.3734 17.2056 12.6269 20.0135 18.5263 10.4987 33.6601 38.6844 7.1471 10.3519 155.6493
temp: 298.150 k
press: 1.00000 atm
elementType: 7 7 7 7 7 6 6 6 6 1 1 1
symmnumber: 1
zpe: 210468.7 jmol-1
zpe.correction: 0.080163 hartree
zpe.thermalcorrener: 0.085868 hartree
zpe.thermalcorrenthalpy: 0.086812 hartree
zpe.thermalcorrgfe: 0.050071 hartree
zpe.sumelectzpe: -427.298342 hartree
zpe.sumelectthermal: -427.292637 hartree
zpe.sumelectthermalent: -427.291693 hartree
zpe.sumelectthermalfe: -427.328435 hartree
dipole: 2.3476 1.6125 0.0004
dipole: 2.8481
quadrupole: -44.0268 -58.3236 -51.2521
quadrupole: 1.5390 0.0021 -0.0007
quadrupole: 7.1740 -7.1228 -0.0512 1.5390 0.0021 -0.0007
hfenergy: -427.3785053 hartree
pointgroup: C01 [X(C4H3N5)]
dipole: -0.9053232 -0.6602609 0.0001547 debye
dipolederiv: 0.0037255 0.1054098 0.0000048 -0.2000869 -0.3426682 0.0001118 -0.0001259 -0.0000676 -0.1146933 -0.4960515 0.0302243 -0.0000687 -0.014795 0.4647455 -0.0000386 0.0004575 -0.0000405 -0.1942318 -0.1156283 -0.2489209 0.0000178 0.2071427 -0.2763086 -0.0000988 -0.0001818 0.0000526 -0.1375675 -0.4134227 -0.0084082 -0.0000419 0.0545777 -0.3292309 -0.0000248 0.0000476 -0.0000039 -0.1962246 -0.50538 -0.0945811 -0.0000248 -0.2478651 -0.5042626 0.0000248 -0.0000042 -0.0000272 -0.2008274 -0.2160529 0.0140381 0.0000128 0.155353 -0.2402361 0.0000273 -0.0000732 0.000016 0.139097 0.3379574 0.2385532 0.0000619 -0.076675 0.0626171 0.0000353 0.0000177 0.0000401 0.1301548 0.5113307 -0.0719325 0.0000332 -0.0404223 0.427897 -0.0000109 0.0000595 0.0000228 -0.0018606 0.4376276 0.1191799 0.0000227 0.2126453 0.5119524 -0.0000378 -0.0000933 -0.0000155 -0.0290214 0.0916047 -0.0045057 -0.0000016 0.0056988 -0.0468177 0.0000055 0.00001 -0.0000151 0.1241061 0.3788294 -0.0038633 -0.0000123 0.0071369 0.224278 0.0000078 -0.0001576 0.0000143 0.3441028 -0.0145398 -0.0751935 -0.0000039 -0.0627102 0.0480339 -0.0000014 0.0000437 0.0000239 0.1369659 unknown
polarizability: 103.0030115|1.0851205|76.411633|0.0046424|-0.0023304|30.8644798 unknown
InChI: InChI=1S/C4H3N5/c1-3-4(6-2-5-1)8-9-7-3/h1-2,9H
charge 0 multiplicity 1
12 atoms
N  -1.565316 -1.235155 -0.00023
N  -2.274172 -0.059799 0.000047
N  -1.600084 1.134927 -0.000367
N  0.850253 1.471128 -0.000053
N  2.129705 -0.643839 0.000176
C  -0.263927 -0.755822 -0.000017
C  -0.283021 0.69469 -0.000094
C  1.007664 -1.396658 0.00013
C  1.990235 0.743475 0.000145
H  1.123712 -2.486017 0.000128
H  -3.294892 -0.069775 0.000114
H  2.928242 1.305744 0.000022
