program: Orca
programVersion: 5.0.2
elementType: Cl S P O O O O O N N C C C C C C C C C H H H H H H H H H H
charge: 0
multiplicity: 1
keywords: wb97x-d3
keywords: def2-TZVPP
keywords: def2/J RIJCOSX
keywords: DEFGRID2
keywords: scfconv7
keywords: smallprint printgap noloewdin
keywords: NOSOSCF
formula: C9H10ClN2O5PS
InChI: InChI=1/C9H10ClN2O5PS/c1-15-18(14,16-2)19-5-12-8-7(17-9(12)13)3-6(10)4-11-8/h3-4H,5H2,1-2H3
29 atoms
Cl -4.573624 1.165509 -1.203974
S  2.728194 -0.46102 1.516147
P  2.410325 0.856417 -0.052305
O  -0.742378 -2.244682 -0.622461
O  1.56794 0.088934 -1.172429
O  1.334276 1.861787 0.5322
O  1.077848 -3.141686 0.363454
O  3.716001 1.384027 -0.508026
N  0.09258 -1.195981 1.140957
N  -1.505229 0.620609 1.229049
C  -0.996637 -0.460541 0.708959
C  1.038794 -0.810416 2.14239
C  -1.503675 -1.140091 -0.387208
C  0.247394 -2.279552 0.318622
C  -2.619752 -0.690578 -1.033293
C  -3.159225 0.479891 -0.493645
C  -2.588403 1.0970 0.608643
C  2.23367 -0.770809 -2.109127
C  0.614878 2.778456 -0.313994
H  0.651004 0.060838 2.661333
H  1.176676 -1.607594 2.871423
H  -3.051695 -1.195817 -1.886181
H  -3.022693 2.000135 1.016719
H  1.46603 -1.169105 -2.766445
H  2.732103 -1.597305 -1.601472
H  2.96089 -0.216702 -2.701027
H  0.070779 3.445962 0.34746
H  -0.089468 2.249773 -0.954056
H  1.300586 3.364198 -0.925593
elementType: Cl S P O N C H
totalener: -2034.60385503 hartree
nucrepener: 2052.81372465 hartree
electener: -4087.41757968 hartree
oneelecener: -6882.55067872 hartree
twoeener: 2795.13309905 hartree
cpcmener: -0.04242799 hartree
kineticenergy: 2029.14526410 hartree
xcener: -133.584433757267 hartree
chargesum: -0.0000000
charge: -0.077795 -0.153767 0.819879 -0.247696 -0.329446 -0.335636 -0.428355 -0.640638 -0.072757 -0.371885 0.202332 -0.043729 0.199414 0.404022 -0.154425 0.139406 -0.049135 -0.115826 -0.119305 0.147847 0.173636 0.155652 0.129702 0.128467 0.116340 0.132579 0.132057 0.117017 0.142043
qa: -0.0778 -0.1538 0.8199 -0.2477 -0.3294 -0.3356 -0.4284 -0.6406 -0.0728 -0.3719 0.2023 -0.0437 0.1994 0.4040 -0.1544 0.1394 -0.0491 -0.1158 -0.1193 0.1478 0.1736 0.1557 0.1297 0.1285 0.1163 0.1326 0.1321 0.1170 0.1420
va: 1.2219 2.2629 5.5162 2.1983 2.0492 2.0906 2.0835 1.9837 3.2050 3.0112 3.9401 3.8848 3.9043 4.3368 4.0870 3.7903 4.1017 3.8208 3.8259 1.0240 0.9877 1.0058 1.0121 0.9901 0.9978 1.0016 0.9879 0.9885 0.9934
dispcorr: -0.018053169 hartree
energy: -2034.621908194016
dipole: 7.60788 -10.47989 -2.87201 2.74400 -2.30771 0.43629 -2.17883 1.92469 -0.25415
magnitude: 2.91605 au
magnitude: 7.41202 debye
