program: Orca
programVersion: 5.0.2
elementType: Cl S P O O O O O N N C C C C C C C C C H H H H H H H H H H
charge: 0
multiplicity: 1
keywords: wb97x-d3
keywords: def2-TZVPP
keywords: def2/J RIJCOSX
keywords: DEFGRID2
keywords: scfconv7
keywords: smallprint printgap noloewdin
keywords: NOSOSCF
formula: C9H10ClN2O5PS
InChI: InChI=1/C9H10ClN2O5PS/c1-15-18(14,16-2)19-5-12-8-7(17-9(12)13)3-6(10)4-11-8/h3-4H,5H2,1-2H3
29 atoms
Cl -5.281966 -0.065904 0.383171
S  1.459912 1.315739 -1.54385
P  2.299855 1.388682 0.350532
O  -0.547136 -2.034325 0.942329
O  1.146753 0.76464 1.253183
O  3.422658 0.25963 0.44389
O  1.614795 -2.367803 0.415681
O  2.738325 2.768873 0.640503
N  0.218562 -1.038891 -0.879829
N  -1.818822 0.090348 -1.519617
C  -1.106387 -0.679997 -0.747352
C  1.153363 -0.474991 -1.800303
C  -1.562145 -1.318576 0.396184
C  0.563451 -1.853526 0.170969
C  -2.8563 -1.172687 0.806177
C  -3.627358 -0.345203 -0.015938
C  -3.090318 0.255827 -1.144263
C  1.355267 0.496198 2.650676
C  4.704754 0.473236 -0.156637
H  2.085299 -1.032729 -1.753631
H  0.767201 -0.542763 -2.816459
H  -3.253373 -1.650591 1.691296
H  -3.702805 0.893024 -1.769314
H  1.951902 -0.40457 2.7870
H  0.37186 0.346994 3.088741
H  1.839557 1.335825 3.149667
H  5.205924 1.336691 0.277795
H  4.618891 0.611603 -1.234844
H  5.29298 -0.418194 0.038709
elementType: Cl S P O N C H
totalener: -2034.60869253 hartree
nucrepener: 2013.26928386 hartree
electener: -4047.87797639 hartree
oneelecener: -6804.24001190 hartree
twoeener: 2756.36203550 hartree
cpcmener: -0.03523005 hartree
kineticenergy: 2029.17521588 hartree
xcener: -133.586387074318 hartree
chargesum: -0.0000000
charge: -0.077286 -0.156821 0.801119 -0.246399 -0.333508 -0.324712 -0.406413 -0.611581 -0.073013 -0.362714 0.206606 -0.041072 0.196157 0.383267 -0.158653 0.125471 -0.036988 -0.115399 -0.108660 0.154390 0.162503 0.154019 0.127590 0.121704 0.123915 0.133181 0.124114 0.110720 0.128464
qa: -0.0773 -0.1568 0.8011 -0.2464 -0.3335 -0.3247 -0.4064 -0.6116 -0.0730 -0.3627 0.2066 -0.0411 0.1962 0.3833 -0.1587 0.1255 -0.0370 -0.1154 -0.1087 0.1544 0.1625 0.1540 0.1276 0.1217 0.1239 0.1332 0.1241 0.1107 0.1285
va: 1.2217 2.2609 5.5369 2.1973 2.0802 2.0691 2.1112 2.0219 3.2187 3.0671 3.9785 3.8835 3.9080 4.3591 4.0763 3.8165 4.1233 3.8195 3.8419 1.0131 0.9958 1.0067 1.0113 0.9972 0.9894 0.9959 0.9985 0.9923 0.9898
dispcorr: -0.016313992 hartree
energy: -2034.625006522311
dipole: 19.25723 -19.67447 -0.41724 -0.86569 -0.64921 -1.51489 2.37365 -2.62943 -0.25578
magnitude: 1.59198 au
magnitude: 4.04650 debye
