program: Orca
programVersion: 5.0.2
elementType: Cl S P O O O O O N N C C C C C C C C C H H H H H H H H H H
charge: 0
multiplicity: 1
keywords: wb97x-d3
keywords: def2-TZVPP
keywords: def2/J RIJCOSX
keywords: DEFGRID2
keywords: scfconv7
keywords: smallprint printgap noloewdin
keywords: NOSOSCF
formula: C9H10ClN2O5PS
InChI: InChI=1/C9H10ClN2O5PS/c1-15-18(14,16-2)19-5-12-8-7(17-9(12)13)3-6(10)4-11-8/h3-4H,5H2,1-2H3
29 atoms
Cl -4.943583 0.634899 0.530626
S  1.700424 0.675323 -2.091349
P  2.314255 1.253694 -0.198153
O  -0.490796 -1.881319 1.191323
O  1.06113 1.097497 0.783364
O  3.232416 0.046961 0.262946
O  1.564933 -2.604181 0.633558
O  2.892429 2.610886 -0.271692
N  0.280983 -1.300661 -0.799088
N  -1.634121 -0.020402 -1.532252
C  -0.978777 -0.751777 -0.675883
C  1.202796 -1.078036 -1.86749
C  -1.43601 -1.125857 0.57874
C  0.580679 -1.984996 0.35397
C  -2.666323 -0.730657 1.01972
C  -3.373908 0.058539 0.108317
C  -2.8417 0.385902 -1.129628
C  0.072638 2.132941 0.840212
C  3.670369 -0.104123 1.623767
H  2.080867 -1.699082 -1.712254
H  0.750555 -1.35512 -2.819407
H  -3.060152 -0.998656 1.990684
H  -3.405394 0.9965 -1.823282
H  -0.749002 1.752606 1.441551
H  -0.303699 2.387088 -0.15129
H  0.47673 3.027434 1.31219
H  4.244024 0.765435 1.946657
H  4.309629 -0.982757 1.64606
H  2.829476 -0.258407 2.298226
elementType: Cl S P O N C H
totalener: -2034.60705923 hartree
nucrepener: 2047.58764859 hartree
electener: -4082.19470782 hartree
oneelecener: -6872.20712975 hartree
twoeener: 2790.01242193 hartree
cpcmener: -0.03434210 hartree
kineticenergy: 2029.17228873 hartree
xcener: -133.587642586013 hartree
chargesum: 0.0000000
charge: -0.075646 -0.156361 0.806078 -0.242757 -0.327126 -0.334983 -0.410263 -0.610248 -0.075151 -0.338998 0.144147 -0.039627 0.221006 0.406541 -0.179320 0.142220 -0.046437 -0.131361 -0.124269 0.150605 0.165206 0.154449 0.128246 0.127589 0.119557 0.140517 0.133587 0.131582 0.121218
qa: -0.0756 -0.1564 0.8061 -0.2428 -0.3271 -0.3350 -0.4103 -0.6102 -0.0752 -0.3390 0.1441 -0.0396 0.2210 0.4065 -0.1793 0.1422 -0.0464 -0.1314 -0.1243 0.1506 0.1652 0.1544 0.1282 0.1276 0.1196 0.1405 0.1336 0.1316 0.1212
va: 1.2235 2.2558 5.5367 2.2066 2.0426 2.0949 2.1082 2.0226 3.2065 3.0663 4.0257 3.8810 3.8749 4.3385 4.0745 3.7945 4.1108 3.8395 3.8288 1.0201 0.9927 1.0073 1.0120 0.9856 0.9923 1.0020 0.9943 0.9874 0.9924
dispcorr: -0.018072626 hartree
energy: -2034.625131859380
dipole: 11.31697 -13.16450 -1.84753 0.99978 -1.89939 -0.89961 4.11355 -3.49414 0.61941
magnitude: 2.14624 au
magnitude: 5.45531 debye
