program: Gaussian 09
title: 000064963
version: EM64L-G09RevD.01
frameworkgroup: C1[X(C8H20N4)]
method: RPBEPBE
basis: SDD
operation: Freq
keyword: #pfreq=noraman
keyword: PBEPBE/SDD
title: #p freq=noraman PBEPBE/SDD
converged: YES YES NO NO
title: Mulliken charges:
elementType: N N N N C C C C C C C C H H H H H H H H H H H H H H H H H H H H
charge: -0.301037 -0.279461 -0.301354 -0.294224 -0.417055 -0.371441 -0.375288 -0.391041 -0.450810 -0.386877 -0.317378 -0.365985 0.208893 0.230545 0.192678 0.194616 0.200544 0.206954 0.225582 0.224841 0.195630 0.212515 0.202279 0.164440 0.201759 0.173619 0.191745 0.228420 0.248735 0.255079 0.254987 0.238089
chargesum: 0.00000
title: Mulliken charges with hydrogens summed into heavy atoms:
elementType: N N N N C C C C C C C C
charge: -0.052302 -0.024381 -0.046367 -0.056136 0.022383 0.015854 0.032210 0.059381 -0.042665 -0.020157 0.057999 0.054180
polarizability: 1.26791627e+02 4.65788192e-01 1.21940096e+02 -3.87978423e+00 8.63217840e-02 9.26879551e+01
1716.lowfreq: -10.9974 -7.0519 -0.0006 0.0003 0.0003 6.8156 81.1647 93.1252 122.1069
frequency: 81.1507 93.0624 122.0672 125.5371 140.5366 196.3983 206.3900 233.7750 263.9559 283.3403 314.0486 317.6122 337.6194 368.2171 452.7373 457.4248 477.3137 500.2388 521.6630 568.8704 609.5502 649.3376 736.4226 759.5247 821.1939 836.9299 891.7407 932.3598 947.5962 973.2669 985.6220 995.0656 1006.7063 1031.3764 1045.9425 1060.5506 1101.9365 1134.8781 1143.9956 1154.5772 1164.9974 1178.6827 1186.4648 1226.8347 1241.8843 1253.2342 1266.1882 1273.8563 1297.4579 1307.8819 1311.8047 1316.6024 1328.9733 1354.8760 1356.4593 1364.0410 1367.4984 1376.0343 1432.3500 1438.4146 1447.8602 1451.7205 1456.3328 1459.9259 1463.5498 1469.0508 1473.8298 1476.1161 1486.3245 1493.6705 2821.6382 2825.9469 2856.7014 2903.3733 2939.5842 2943.6026 2969.4515 2989.6473 3000.3467 3004.5191 3014.2837 3023.0404 3024.1390 3053.9184 3072.5508 3078.7990 3409.9937 3469.4337 3471.6470 3489.5680
redmass: 2.6884 2.9387 3.4164 3.3069 2.4143 2.0362 2.3780 2.5708 2.3443 2.5266 1.7990 2.1444 2.4497 2.2689 2.1591 3.2477 2.1796 1.5914 2.1574 1.6331 1.6125 1.3994 1.3091 1.3274 1.8941 2.0473 2.0441 2.0074 2.5430 2.5772 3.6665 2.2270 2.5168 2.5863 2.0320 2.1611 1.8099 2.6289 2.2247 3.0773 1.9863 1.6649 3.0100 1.3256 1.2992 1.2832 1.1837 1.1808 1.1458 1.2247 1.2441 1.1812 1.1967 1.2409 1.2406 1.2912 1.3762 1.2534 1.1257 1.1088 1.1202 1.1991 1.1565 1.0990 1.1426 1.1181 1.2242 1.1034 1.0982 1.0888 1.0713 1.0723 1.0721 1.0669 1.0664 1.0701 1.0681 1.0862 1.0839 1.0778 1.0784 1.0891 1.0945 1.0888 1.0990 1.0970 1.0736 1.0751 1.0746 1.0748
irintensity: 0.1570 1.1977 1.0429 2.2796 2.4313 5.3571 1.0110 2.1487 11.2625 2.8683 35.9791 17.8964 15.5370 10.3088 48.7501 16.0836 133.6710 138.8285 7.0777 70.7470 114.1433 110.4765 10.2738 16.9288 7.3934 2.3680 2.9551 1.6413 1.9549 9.3370 12.9151 3.8944 7.1360 21.5512 1.1447 8.0728 5.5933 6.2233 13.0762 68.7738 6.5996 24.0196 33.0507 4.0662 3.8204 11.7577 11.9522 7.6076 5.5515 6.4875 4.7336 0.9784 6.0960 15.6580 0.5856 5.5965 10.1686 7.3554 20.0090 3.6998 5.4637 1.1950 10.2490 8.7266 9.8301 12.9057 10.3248 8.2020 0.3156 14.6627 143.5000 102.5049 160.9634 82.7111 72.5948 73.4064 54.7023 53.0542 84.9912 31.7980 53.4191 26.4577 56.9309 31.6194 41.9638 51.5346 1.4631 2.1966 1.2806 0.0376
temp: 298.150 k
press: 1.00000 atm
elementType: 7 7 7 7 6 6 6 6 6 6 6 6 1 1 1 1 1 1 1 1 1 1 1 1 1 1 1 1 1 1 1 1
symmnumber: 1
zpe: 759423.1 jmol-1
zpe.correction: 0.289249 hartree
zpe.thermalcorrener: 0.302456 hartree
zpe.thermalcorrenthalpy: 0.303401 hartree
zpe.thermalcorrgfe: 0.250824 hartree
zpe.sumelectzpe: -534.775034 hartree
zpe.sumelectthermal: -534.761826 hartree
zpe.sumelectthermalent: -534.760882 hartree
zpe.sumelectthermalfe: -534.813459 hartree
dipole: 0.0529 -1.1591 1.2619
dipole: 1.7143
quadrupole: -78.1897 -72.4847 -75.3539
quadrupole: -0.8080 -8.3885 1.8842
quadrupole: -2.8469 2.8580 -0.0111 -0.8080 -8.3885 1.8842
hfenergy: -535.0642829 hartree
pointgroup: C01 [X(C8H20N4)]
dipole: 0.0265816 -0.4680937 0.4848283 debye
polarizability: 126.6412201|0.5400361|121.9107488|-4.5034803|0.8149698|92.8677096 unknown
InChI: InChI=1S/C8H20N4/c1-2-10-5-6-12-8-7-11-4-3-9-1/h9-12H,1-8H2
charge 0 multiplicity 1
32 atoms
N  -0.083602 2.487967 -0.014344
N  2.916889 0.045684 0.003318
N  -2.93662 -0.080989 -0.078482
N  0.048643 -1.426491 0.188406
C  1.061673 1.712691 -0.533852
C  -1.188801 1.708531 0.59134
C  2.028002 1.099798 0.532657
C  -2.008006 0.979003 -0.515094
C  2.554283 -1.372903 0.133048
C  -2.41865 -1.318881 0.542626
C  1.246259 -1.900354 -0.534199
C  -1.257791 -1.974816 -0.241696
H  1.64504 2.361914 -1.219438
H  0.665912 0.875598 -1.132529
H  -1.84758 2.413298 1.136254
H  -0.837057 0.946386 1.324987
H  2.640529 1.912647 0.979594
H  1.423933 0.661023 1.346458
H  -2.587032 1.730651 -1.084117
H  -1.29695 0.53138 -1.228878
H  2.500596 -1.621914 1.215827
H  3.39784 -1.964826 -0.273666
H  -3.263276 -2.034959 0.583355
H  -2.067553 -1.187638 1.600067
H  1.196662 -1.551298 -1.585918
H  1.30933 -3.02121 -0.569527
H  -1.313848 -3.084734 -0.105687
H  -1.397552 -1.781909 -1.322345
H  0.202837 3.295875 0.550237
H  3.343995 0.285286 -0.897328
H  -3.759583 0.282598 0.415583
H  0.168177 -1.543108 1.205745
