program: Orca
programVersion: 5.0.4
elementType: Cl S P O O O O O N N C C C C C C C C C H H H H H H H H H H
charge: 0
multiplicity: 1
keywords: wb97x-d3
keywords: def2-TZVPP
keywords: def2/J RIJCOSX
keywords: DEFGRID2
keywords: scfconv7
keywords: smallprint printgap noloewdin
keywords: NOSOSCF
formula: C9H10ClN2O5PS
InChI: InChI=1/C9H10ClN2O5PS/c1-15-18(14,16-2)19-5-12-8-7(17-9(12)13)3-6(10)4-11-8/h3-4H,5H2,1-2H3
29 atoms
Cl -4.602083 0.3827 1.535927
S  2.68141 -0.007022 -1.4273
P  2.077508 1.201457 0.170523
O  -0.290988 -2.376376 0.912054
O  0.675246 1.822865 -0.255758
O  1.519448 0.214908 1.297844
O  1.647892 -2.965601 -0.094113
O  3.182523 2.096917 0.532081
N  0.27806 -1.304378 -0.942687
N  -1.632942 0.171333 -1.06635
C  -0.917615 -0.76461 -0.5127
C  1.111946 -0.787749 -1.979367
C  -1.241839 -1.450569 0.650044
C  0.672256 -2.287973 -0.060009
C  -2.382505 -1.14112 1.335479
C  -3.146751 -0.118673 0.763548
C  -2.752582 0.494058 -0.416104
C  0.639716 2.834166 -1.256529
C  2.464041 -0.435868 2.15192
H  1.431751 -1.587768 -2.64547
H  0.520093 -0.075508 -2.548651
H  -2.675474 -1.635478 2.250655
H  -3.36336 1.274028 -0.851752
H  -0.403053 2.963933 -1.531308
H  1.206049 2.543091 -2.14462
H  1.041495 3.772631 -0.875438
H  3.04349 0.291532 2.718792
H  3.138927 -1.075202 1.58092
H  1.888271 -1.055552 2.833811
totalener: -2034.58218058 hartree
nucrepener: 2060.98964689 hartree
electener: -4095.57182748 hartree
oneelecener: -6899.20169844 hartree
twoeener: 2803.62987096 hartree
kineticenergy: 2029.25165054 hartree
xcener: -133.594044020375 hartree
chargesum: -0.0000000
charge: -0.062233 -0.140117 0.762048 -0.234245 -0.301871 -0.321691 -0.300352 -0.505067 -0.094903 -0.346119 0.188931 -0.069627 0.197945 0.328917 -0.169764 0.125947 -0.041013 -0.130293 -0.138169 0.152737 0.129482 0.136252 0.110731 0.113743 0.096643 0.137434 0.136308 0.122484 0.115862
qa: -0.0622 -0.1401 0.7620 -0.2342 -0.3019 -0.3217 -0.3004 -0.5051 -0.0949 -0.3461 0.1889 -0.0696 0.1979 0.3289 -0.1698 0.1259 -0.0410 -0.1303 -0.1382 0.1527 0.1295 0.1363 0.1107 0.1137 0.0966 0.1374 0.1363 0.1225 0.1159
va: 1.2398 2.2525 5.5784 2.2071 2.1082 2.0915 2.2170 2.1470 3.1808 3.0408 3.9657 3.9359 3.9087 4.3935 4.0807 3.8522 4.1239 3.8677 3.8423 0.9947 1.0114 1.0131 1.0139 0.9907 0.9978 0.9972 0.9989 0.9964 0.9902
dispcorr: -0.017856464 hartree
energy: -2034.600037048233
dipole: 9.46830 -10.76839 -1.30009 3.98249 -3.96728 0.01521 -3.97413 3.48817 -0.48596
magnitude: 1.38803 au
magnitude: 3.52808 debye
