program: Orca
programVersion: 5.0.3
elementType: S O O N N C C C C C C C H H H H H H H H H H H H H H
charge: 0
multiplicity: 1
keywords: wb97x-d3
keywords: def2-TZVPP
keywords: def2/J RIJCOSX
keywords: DEFGRID2
keywords: scfconv7
keywords: smallprint printgap noloewdin
keywords: NOSOSCF
formula: C7H14N2O2S
InChI: InChI=1/C7H14N2O2S/c1-7(2,12-4)5-9-11-6(10)8-3/h5,8H,1-4H3
26 atoms
S  2.619915 1.072781 0.54879
O  -1.470023 -0.83207 0.376164
O  -2.300917 0.674716 -1.105002
N  -0.257511 -0.725032 -0.305833
N  -3.638481 -0.413143 0.369725
C  2.118152 -0.626567 0.040331
C  2.301132 -0.854327 -1.448861
C  3.000379 -1.573057 0.848824
C  0.708663 -0.745488 0.515871
C  1.657341 2.112802 -0.566449
C  -2.470004 -0.123092 -0.205452
C  -4.844231 0.29789 0.013888
H  2.026189 -1.87855 -1.707341
H  1.697575 -0.185935 -2.060013
H  3.346882 -0.709264 -1.718369
H  2.894668 -1.414631 1.922909
H  4.049228 -1.439834 0.58412
H  2.727126 -2.607266 0.63437
H  0.555219 -0.804678 1.592984
H  2.033833 2.077931 -1.586724
H  1.75079 3.134943 -0.201551
H  0.599821 1.848575 -0.559364
H  -3.66974 -1.088718 1.116542
H  -4.760829 1.366308 0.213353
H  -5.65895 -0.09437 0.614482
H  -5.101848 0.158678 -1.035507
elementType: S O N C H
totalener: -933.37151024 hartree
nucrepener: 834.11685066 hartree
electener: -1767.48836090 hartree
oneelecener: -2934.92123603 hartree
twoeener: 1167.43287512 hartree
cpcmener: -0.03313011 hartree
kineticenergy: 930.35329684 hartree
xcener: -70.154072789265 hartree
chargesum: 0.0000000
charge: -0.168169 -0.229950 -0.547344 -0.179223 -0.224953 0.220221 -0.318082 -0.274938 -0.012362 -0.267759 0.521957 -0.163398 0.108322 0.099037 0.106916 0.109127 0.106507 0.108621 0.122987 0.117372 0.133634 0.105007 0.187714 0.112100 0.115885 0.110771
qa: -0.1682 -0.2300 -0.5473 -0.1792 -0.2250 0.2202 -0.3181 -0.2749 -0.0124 -0.2678 0.5220 -0.1634 0.1083 0.0990 0.1069 0.1091 0.1065 0.1086 0.1230 0.1174 0.1336 0.1050 0.1877 0.1121 0.1159 0.1108
va: 2.2151 2.0380 1.9541 2.8314 3.2001 3.7924 3.9300 3.8659 4.0466 3.9958 4.2961 3.8993 1.0062 1.0050 1.0095 1.0093 1.0104 1.0020 1.0324 0.9958 0.9999 1.0187 1.0071 0.9910 0.9975 0.9909
dispcorr: -0.009368636 hartree
energy: -933.380878876278
dipole: 2.09408 -2.63301 -0.53893 -1.30751 0.20980 -1.09771 -1.73484 3.18005 1.44520
magnitude: 1.89315 au
magnitude: 4.81201 debye
