program: Orca
programVersion: 5.0.3
elementType: S O O N N C C C C C C C H H H H H H H H H H H H H H
charge: 0
multiplicity: 1
keywords: wb97x-d3
keywords: def2-TZVPP
keywords: def2/J RIJCOSX
keywords: DEFGRID2
keywords: scfconv7
keywords: smallprint printgap noloewdin
keywords: NOSOSCF
formula: C7H14N2O2S
InChI: InChI=1/C7H14N2O2S/c1-7(2,12-4)5-9-11-6(10)8-3/h5,8H,1-4H3
26 atoms
S  2.600775 0.873038 -1.015183
O  -1.424528 0.145109 1.073569
O  -3.555458 0.481161 1.40235
N  -0.469468 -0.374529 0.215277
N  -2.910977 -0.47485 -0.562775
C  1.904452 -0.584037 -0.125846
C  1.57894 -1.598478 -1.213927
C  2.91447 -1.157518 0.86052
C  0.697478 -0.120628 0.627034
C  2.862429 2.093019 0.289365
C  -2.712116 0.057986 0.641221
C  -4.217153 -0.61688 -1.157294
H  0.87043 -1.214422 -1.946721
H  2.488479 -1.888256 -1.741429
H  1.152278 -2.499328 -0.77077
H  3.195097 -0.439613 1.631593
H  3.82037 -1.468177 0.339856
H  2.495198 -2.032104 1.364667
H  0.865587 0.440424 1.546273
H  1.928917 2.484661 0.689227
H  3.40214 2.921159 -0.169473
H  3.476467 1.707168 1.10149
H  -2.110739 -0.795504 -1.086369
H  -4.979977 -0.217625 -0.495739
H  -4.443746 -1.66622 -1.347422
H  -4.268278 -0.076942 -2.102844
elementType: S O N C H
totalener: -933.37304573 hartree
nucrepener: 828.61403287 hartree
electener: -1761.98707860 hartree
oneelecener: -2922.86258004 hartree
twoeener: 1160.87550145 hartree
cpcmener: -0.02718247 hartree
kineticenergy: 930.37031894 hartree
xcener: -70.158563089724 hartree
chargesum: 0.0000000
charge: -0.165383 -0.178794 -0.513588 -0.192279 -0.214255 0.216015 -0.299021 -0.311996 -0.005821 -0.274081 0.431334 -0.141074 0.102047 0.111767 0.107479 0.107401 0.101651 0.110378 0.131185 0.114720 0.129747 0.117142 0.189023 0.103283 0.111279 0.111841
qa: -0.1654 -0.1788 -0.5136 -0.1923 -0.2143 0.2160 -0.2990 -0.3120 -0.0058 -0.2741 0.4313 -0.1411 0.1020 0.1118 0.1075 0.1074 0.1017 0.1104 0.1312 0.1147 0.1297 0.1171 0.1890 0.1033 0.1113 0.1118
va: 2.1897 2.0391 2.0081 2.8879 3.1624 3.8150 3.8911 3.9399 4.0181 4.0075 4.4310 3.8686 1.0155 1.0090 1.0052 1.0020 1.0114 1.0024 1.0164 0.9951 0.9979 0.9971 1.0164 1.0205 0.9914 0.9915
dispcorr: -0.009183408 hartree
energy: -933.382229138628
dipole: 7.18928 -5.39424 1.79504 -4.34704 3.49725 -0.84979 -2.61715 1.71922 -0.89793
magnitude: 2.17959 au
magnitude: 5.54007 debye
