program: Orca
programVersion: 5.0.3
elementType: S P O O O N C C C C H H H H H H H H H H
charge: 0
multiplicity: 1
keywords: wb97x-d3
keywords: def2-TZVPP
keywords: def2/J RIJCOSX
keywords: DEFGRID2
keywords: scfconv7
keywords: smallprint printgap noloewdin
keywords: NOSOSCF
formula: C4H10NO3PS
InChI: InChI=1/C4H10NO3PS/c1-4(6)5-9(7,8-2)10-3/h5H,1-3H3
20 atoms
S  0.920255 1.531237 0.183944
P  0.437713 -0.462195 0.452885
O  1.370204 -1.3256 -0.515788
O  0.497165 -0.778851 1.899302
O  -2.264125 0.439467 1.07898
N  -1.016025 -0.782479 -0.341978
C  -2.207095 -0.246677 0.076049
C  -3.388799 -0.590143 -0.776845
C  0.660916 1.722561 -1.605403
C  2.783902 -1.370752 -0.281454
H  -1.0021 -1.314663 -1.204832
H  -3.184109 -0.397017 -1.829848
H  -4.259277 -0.017663 -0.468601
H  -3.616114 -1.653082 -0.679615
H  -0.391877 1.627914 -1.86054
H  1.253485 1.010958 -2.174631
H  0.991316 2.728605 -1.856309
H  3.234955 -0.386453 -0.411217
H  3.20041 -2.052991 -1.016868
H  3.00618 -1.742449 0.718402
elementType: S P O N C H
totalener: -1178.62564097 hartree
nucrepener: 812.61087307 hartree
electener: -1991.23651405 hartree
oneelecener: -3238.02088177 hartree
twoeener: 1246.78436773 hartree
cpcmener: -0.05480815 hartree
kineticenergy: 1175.27453498 hartree
xcener: -76.613815803004 hartree
chargesum: -0.0000000
charge: -0.157217 0.776954 -0.349670 -0.640257 -0.497713 -0.220508 0.363340 -0.230007 -0.232923 -0.114961 0.201812 0.115546 0.095010 0.124382 0.126242 0.130896 0.137573 0.112923 0.130974 0.127604
qa: -0.1572 0.7770 -0.3497 -0.6403 -0.4977 -0.2205 0.3633 -0.2300 -0.2329 -0.1150 0.2018 0.1155 0.0950 0.1244 0.1262 0.1309 0.1376 0.1129 0.1310 0.1276
va: 2.2844 5.4349 2.0803 1.9675 1.9863 3.1202 4.0879 3.8976 3.9145 3.8348 1.0008 1.0009 1.0189 0.9993 1.0049 1.0054 0.9980 0.9952 0.9902 0.9947
dispcorr: -0.007529586 hartree
energy: -1178.633170559245
dipole: -0.95713 1.42075 0.46362 -1.21666 0.58745 -0.62921 -11.07730 6.74976 -4.32753
magnitude: 4.39754 au
magnitude: 11.17767 debye
