program: Orca
programVersion: 5.0.3
elementType: S P O O O N C C C C H H H H H H H H H H
charge: 0
multiplicity: 1
keywords: wb97x-d3
keywords: def2-TZVPP
keywords: def2/J RIJCOSX
keywords: DEFGRID2
keywords: scfconv7
keywords: smallprint printgap noloewdin
keywords: NOSOSCF
formula: C4H10NO3PS
InChI: InChI=1/C4H10NO3PS/c1-4(6)5-9(7,8-2)10-3/h5H,1-3H3
20 atoms
S  0.976794 1.739945 -0.764471
P  0.25362 0.236868 0.47405
O  1.126326 -1.077329 0.240795
O  0.240615 0.572147 1.917687
O  -1.674115 -1.905832 0.906802
N  -1.239161 -0.038937 -0.274068
C  -2.046152 -1.09182 0.083517
C  -3.381234 -1.123687 -0.591526
C  2.219304 2.455364 0.35671
C  1.26933 -1.689706 -1.043277
H  -1.62065 0.656295 -0.904851
H  -3.290884 -0.942574 -1.66198
H  -4.013042 -0.334534 -0.179287
H  -3.868331 -2.080559 -0.425464
H  2.691924 3.262454 -0.198498
H  2.977441 1.724884 0.624513
H  1.751387 2.864742 1.246743
H  2.064781 -2.424421 -0.952159
H  1.548788 -0.962166 -1.806763
H  0.351103 -2.194832 -1.342125
elementType: S P O N C H
totalener: -1178.62201259 hartree
nucrepener: 808.10448355 hartree
electener: -1986.72649614 hartree
oneelecener: -3229.05491434 hartree
twoeener: 1242.32841820 hartree
cpcmener: -0.05150999 hartree
kineticenergy: 1175.27700240 hartree
xcener: -76.613306111525 hartree
chargesum: 0.0000000
charge: -0.173102 0.779064 -0.335793 -0.642630 -0.497845 -0.214653 0.369855 -0.237457 -0.234992 -0.098580 0.188954 0.115084 0.126239 0.096963 0.138574 0.136595 0.126179 0.130719 0.109658 0.117169
qa: -0.1731 0.7791 -0.3358 -0.6426 -0.4978 -0.2147 0.3699 -0.2375 -0.2350 -0.0986 0.1890 0.1151 0.1262 0.0970 0.1386 0.1366 0.1262 0.1307 0.1097 0.1172
va: 2.2782 5.4067 2.0594 1.9656 1.9807 3.1148 4.0874 3.9090 3.9125 3.8404 1.0083 1.0020 0.9975 1.0176 0.9971 0.9994 1.0100 0.9902 0.9993 0.9881
dispcorr: -0.007146067 hartree
energy: -1178.629158659860
dipole: -1.22413 0.96103 -0.26310 -0.98776 2.08675 1.09899 -6.32598 2.85524 -3.47074
magnitude: 3.65007 au
magnitude: 9.27774 debye
