program: Orca
programVersion: 5.0.3
elementType: S P O O O N C C C C H H H H H H H H H H
charge: 0
multiplicity: 1
keywords: wb97x-d3
keywords: def2-TZVPP
keywords: def2/J RIJCOSX
keywords: DEFGRID2
keywords: scfconv7
keywords: smallprint printgap noloewdin
keywords: NOSOSCF
formula: C4H10NO3PS
InChI: InChI=1/C4H10NO3PS/c1-4(6)5-9(7,8-2)10-3/h5H,1-3H3
20 atoms
S  0.956362 1.760341 -0.717607
P  0.272355 0.220096 0.506589
O  1.133401 -1.084979 0.198528
O  0.304651 0.520686 1.954584
O  -1.640687 -1.998503 0.801166
N  -1.239562 -0.026471 -0.217578
C  -2.037859 -1.109058 0.079648
C  -3.397373 -1.076515 -0.551677
C  2.200499 2.479006 0.398517
C  1.2466 -1.653272 -1.105498
H  -1.663638 0.739085 -0.728032
H  -3.882995 -2.044293 -0.456317
H  -3.343072 -0.80244 -1.605223
H  -4.015187 -0.328135 -0.051098
H  2.646434 3.309758 -0.144644
H  2.980584 1.761582 0.639263
H  1.739619 2.857585 1.306039
H  2.06452 -2.368627 -1.064986
H  1.48049 -0.898749 -1.858737
H  0.333679 -2.177235 -1.38878
elementType: S P O N C H
totalener: -1178.62292085 hartree
nucrepener: 807.40328459 hartree
electener: -1986.02620544 hartree
oneelecener: -3227.51032349 hartree
twoeener: 1241.48411805 hartree
cpcmener: -0.03966990 hartree
kineticenergy: 1175.27123303 hartree
xcener: -76.608885375857 hartree
chargesum: 0.0000000
charge: -0.183275 0.768670 -0.325056 -0.609625 -0.460827 -0.218624 0.347553 -0.243171 -0.236201 -0.101314 0.181280 0.097952 0.111680 0.123374 0.135676 0.134664 0.126430 0.129403 0.107302 0.114107
qa: -0.1833 0.7687 -0.3251 -0.6096 -0.4608 -0.2186 0.3476 -0.2432 -0.2362 -0.1013 0.1813 0.0980 0.1117 0.1234 0.1357 0.1347 0.1264 0.1294 0.1073 0.1141
va: 2.2690 5.4247 2.0691 2.0095 2.0238 3.0967 4.1167 3.9016 3.9161 3.8498 1.0136 1.0181 1.0025 0.9982 0.9973 0.9996 1.0101 0.9906 0.9992 0.9881
dispcorr: -0.007138455 hartree
energy: -1178.630059303793
dipole: -1.50984 1.12459 -0.38525 -0.50014 1.68708 1.18694 -6.21682 3.16657 -3.05025
magnitude: 3.29565 au
magnitude: 8.37687 debye
