program: Orca
programVersion: 5.0.3
elementType: S P O O O N C C C C H H H H H H H H H H
charge: 0
multiplicity: 1
keywords: wb97x-d3
keywords: def2-TZVPP
keywords: def2/J RIJCOSX
keywords: DEFGRID2
keywords: scfconv7
keywords: smallprint printgap noloewdin
keywords: NOSOSCF
formula: C4H10NO3PS
InChI: InChI=1/C4H10NO3PS/c1-4(6)5-9(7,8-2)10-3/h5H,1-3H3
20 atoms
S  0.848645 1.287029 -0.827527
P  0.396902 -0.380336 0.327068
O  1.291559 -1.54613 -0.301368
O  0.527367 -0.127961 1.779738
O  -2.219794 0.817733 0.508195
N  -1.091539 -0.993957 -0.188248
C  -2.246176 -0.284013 -0.003899
C  -3.494835 -0.968577 -0.470176
C  0.785495 2.60664 0.41824
C  2.708998 -1.545077 -0.092931
H  -1.131932 -1.902427 -0.634791
H  -3.421479 -1.228805 -1.527148
H  -4.358419 -0.325779 -0.321284
H  -3.645804 -1.896817 0.083464
H  -0.223046 2.738528 0.797157
H  1.092865 3.516293 -0.094059
H  1.475639 2.41553 1.234056
H  3.184763 -0.732797 -0.643588
H  3.082391 -2.49475 -0.467205
H  2.958467 -1.457539 0.964755
elementType: S P O N C H
totalener: -1178.62558090 hartree
nucrepener: 810.27541685 hartree
electener: -1988.90099775 hartree
oneelecener: -3233.71584416 hartree
twoeener: 1244.81484641 hartree
cpcmener: -0.03319662 hartree
kineticenergy: 1175.28713487 hartree
xcener: -76.612558333596 hartree
chargesum: -0.0000000
charge: -0.169224 0.786371 -0.358135 -0.606173 -0.478078 -0.217014 0.361575 -0.238371 -0.223563 -0.115415 0.188231 0.115455 0.095348 0.118467 0.125087 0.133215 0.122031 0.111140 0.127451 0.121600
qa: -0.1692 0.7864 -0.3581 -0.6062 -0.4781 -0.2170 0.3616 -0.2384 -0.2236 -0.1154 0.1882 0.1155 0.0953 0.1185 0.1251 0.1332 0.1220 0.1111 0.1275 0.1216
va: 2.2701 5.4205 2.1017 1.9909 2.0172 3.1439 4.0983 3.8891 3.9039 3.8514 1.0107 1.0005 1.0199 1.0007 1.0120 0.9987 1.0123 0.9966 0.9915 0.9931
dispcorr: -0.007033567 hartree
energy: -1178.632614467419
dipole: -0.84382 1.15670 0.31289 -0.91518 -0.50420 -1.41938 -1.29159 -0.47911 -1.77070
magnitude: 2.29084 au
magnitude: 5.82284 debye
