program: Orca
programVersion: 5.0.3
elementType: S P O O O N C C C C H H H H H H H H H H
charge: 0
multiplicity: 1
keywords: wb97x-d3
keywords: def2-TZVPP
keywords: def2/J RIJCOSX
keywords: DEFGRID2
keywords: scfconv7
keywords: smallprint printgap noloewdin
keywords: NOSOSCF
formula: C4H10NO3PS
InChI: InChI=1/C4H10NO3PS/c1-4(6)5-9(7,8-2)10-3/h5H,1-3H3
20 atoms
S  0.381127 1.612828 -0.405447
P  0.377416 -0.143395 0.727668
O  1.246777 -1.224477 -0.04789
O  0.784209 0.02107 2.133509
O  -1.474705 -0.541139 -1.556704
N  -1.2375 -0.68645 0.668752
C  -1.974265 -0.778153 -0.4810
C  -3.41806 -1.162841 -0.288555
C  1.610068 2.533846 0.574747
C  1.527459 -1.322123 -1.437083
H  -1.678684 -0.825757 1.56582
H  -3.954144 -0.36525 0.228558
H  -3.512418 -2.067037 0.313684
H  -3.890856 -1.327979 -1.252142
H  1.335657 2.558897 1.624145
H  1.609627 3.544414 0.173666
H  2.605079 2.112186 0.465565
H  0.814568 -1.983895 -1.924585
H  2.528658 -1.738642 -1.527746
H  1.497096 -0.349285 -1.927123
totalener: -1178.60190234 hartree
nucrepener: 815.86631932 hartree
electener: -1994.46822165 hartree
oneelecener: -3244.23254119 hartree
twoeener: 1249.76431954 hartree
kineticenergy: 1175.32910728 hartree
xcener: -76.615395593561 hartree
chargesum: -0.0000000
charge: -0.159770 0.744893 -0.301749 -0.521349 -0.398265 -0.239854 0.322174 -0.261360 -0.245994 -0.116110 0.151061 0.107156 0.099447 0.106890 0.132524 0.118888 0.119494 0.112385 0.118264 0.111275
qa: -0.1598 0.7449 -0.3017 -0.5213 -0.3983 -0.2399 0.3222 -0.2614 -0.2460 -0.1161 0.1511 0.1072 0.0994 0.1069 0.1325 0.1189 0.1195 0.1124 0.1183 0.1113
va: 2.2592 5.4765 2.1092 2.1187 2.0779 3.1349 4.1043 3.8818 3.9314 3.8635 1.0311 1.0011 1.0040 1.0198 1.0124 0.9993 1.0010 0.9884 0.9871 1.0058
dispcorr: -0.007164933 hartree
energy: -1178.609067268729
dipole: -2.16559 1.46537 -0.70023 -0.38798 0.29776 -0.09022 -3.00243 2.70004 -0.30239
magnitude: 0.76805 au
magnitude: 1.95222 debye
