program: Orca
programVersion: 5.0.3
elementType: S P O O O N C C C C H H H H H H H H H H
charge: 0
multiplicity: 1
keywords: wb97x-d3
keywords: def2-TZVPP
keywords: def2/J RIJCOSX
keywords: DEFGRID2
keywords: scfconv7
keywords: smallprint printgap noloewdin
keywords: NOSOSCF
formula: C4H10NO3PS
InChI: InChI=1/C4H10NO3PS/c1-4(6)5-9(7,8-2)10-3/h5H,1-3H3
20 atoms
S  0.441532 1.806077 -0.442308
P  0.669063 -0.045715 0.460942
O  1.417792 -0.867863 -0.686741
O  1.280235 -0.044297 1.804845
O  -1.496655 -0.325889 -1.558978
N  -0.882743 -0.744786 0.563571
C  -1.792998 -0.746281 -0.468896
C  -3.153634 -1.289061 -0.111283
C  1.499183 2.772948 0.682386
C  1.670697 -2.25548 -0.505375
H  -1.183305 -1.002403 1.492084
H  -3.762637 -1.380779 -1.005823
H  -3.65841 -0.613961 0.582254
H  -3.082432 -2.263927 0.372413
H  1.390225 3.807794 0.364679
H  2.542756 2.485215 0.594362
H  1.179001 2.67847 1.715241
H  0.741673 -2.826507 -0.449925
H  2.259431 -2.441497 0.393966
H  2.23215 -2.589529 -1.374054
totalener: -1178.60217156 hartree
nucrepener: 811.69792923 hartree
electener: -1990.30010079 hartree
oneelecener: -3235.96000046 hartree
twoeener: 1245.65989967 hartree
kineticenergy: 1175.33463718 hartree
xcener: -76.609516442177 hartree
chargesum: 0.0000000
charge: -0.118923 0.732899 -0.289567 -0.527529 -0.359121 -0.276746 0.308962 -0.263081 -0.246669 -0.125120 0.155880 0.108042 0.105532 0.095728 0.119485 0.123426 0.122962 0.095696 0.118950 0.119194
qa: -0.1189 0.7329 -0.2896 -0.5275 -0.3591 -0.2767 0.3090 -0.2631 -0.2467 -0.1251 0.1559 0.1080 0.1055 0.0957 0.1195 0.1234 0.1230 0.0957 0.1190 0.1192
va: 2.2950 5.4555 2.1036 2.1000 2.1180 3.0841 4.1288 3.8770 3.9278 3.8804 1.0296 1.0206 1.0005 1.0039 0.9989 1.0030 1.0120 0.9941 0.9926 0.9919
dispcorr: -0.006927350 hartree
energy: -1178.609098909723
dipole: -2.74094 2.08853 -0.65241 -4.10278 3.41223 -0.69054 2.17241 -1.61074 0.56167
magnitude: 1.10361 au
magnitude: 2.80516 debye
