program: Gaussian 09
title: 000065173
version: EM64L-G09RevD.01
frameworkgroup: C1[X(C16H19N5O8)]
method: RPBEPBE
basis: SDD
operation: Freq
keyword: #p
keyword: freq=noraman
keyword: PBEPBE/SDD
title: #p freq=noraman PBEPBE/SDD
converged: YES YES NO NO
title: Mulliken charges:
elementType: O O O O O O O O N N N N N C C C C C C C C C C C C C C C C H H H H H H H H H H H H H H H H H H H
charge: -0.270563 -0.292729 -0.278511 -0.249096 -0.220183 -0.229807 -0.207653 -0.256765 -0.196947 -0.435670 -0.030804 -0.053164 -0.624359 -0.125468 -0.091704 -0.113059 -0.062664 -0.350640 0.350083 -0.244017 -0.140264 0.325320 0.302393 0.014647 0.137914 -0.769394 0.329526 -0.757532 -0.750196 0.312662 0.309919 0.253047 0.281070 0.243038 0.261171 0.337282 0.342146 0.262843 0.247565 0.263297 0.256255 0.251411 0.256477 0.250898 0.258011 0.252660 0.349409 0.302146
chargesum: 0.00000
title: Mulliken charges with hydrogens summed into heavy atoms:
elementType: O O O O O O O O N N N N N C C C C C C C C C C C C C C C C
charge: -0.270563 -0.292729 -0.278511 -0.249096 -0.220183 -0.229807 -0.207653 -0.256765 -0.196947 -0.093524 -0.030804 -0.053164 0.027196 0.187194 0.218215 0.139988 0.218406 0.153569 0.350083 0.093265 -0.140264 0.325320 0.302393 0.014647 0.137914 0.004311 0.329526 0.006611 0.011373
polarizability: 2.83011964e+02 1.81339056e+00 2.64564089e+02 4.12026981e+00 1.83352774e+01 1.54132975e+02
1716.lowfreq: -5.9178 -2.3535 0.0007 0.0008 0.0008 2.9564 16.3277 19.8553 28.2794
frequency: 16.3274 19.8397 28.2336 31.2836 37.9133 43.5004 45.8053 52.6874 57.8178 65.6361 67.6007 78.0031 81.1586 92.1180 102.5031 109.5174 120.1946 158.7371 169.1112 184.8070 189.2266 212.1963 244.8223 259.7304 267.3675 268.7077 307.4120 309.0916 319.3477 328.1495 342.0616 377.9676 388.9924 405.8739 450.5424 461.5666 498.5800 526.4558 534.0433 539.7181 558.4626 563.0957 568.1197 575.0092 586.9338 611.7555 619.3496 626.0884 639.5233 644.4352 646.8557 666.3504 690.6992 707.4938 767.1175 770.4869 782.1926 812.8519 824.1219 829.7886 831.8805 874.9920 901.0795 932.8098 952.0834 977.4250 978.0674 988.3811 995.0231 995.7528 999.7302 1011.7994 1028.6531 1042.9712 1043.9044 1044.3886 1049.9190 1061.6318 1106.1646 1124.0400 1137.4452 1151.8390 1176.1000 1189.2980 1195.1673 1205.7664 1226.8914 1242.3479 1258.1987 1262.0453 1265.3425 1293.0821 1309.6793 1315.9719 1332.3286 1340.1659 1358.6388 1370.3769 1380.9839 1385.4731 1387.2317 1388.2313 1389.9630 1420.2246 1441.2987 1452.0145 1452.0523 1453.1324 1454.4558 1455.9108 1456.7597 1531.3603 1533.9495 1598.4127 1621.7301 1645.2639 1655.7336 1660.8233 1674.4446 2957.2859 3005.4112 3007.0473 3008.4055 3020.5068 3041.1889 3059.4928 3088.4505 3093.2415 3100.9268 3101.9657 3104.7535 3142.1901 3144.7648 3145.3023 3234.1097 3490.9675 3530.2500 3679.5505
redmass: 5.4807 5.2929 2.8025 2.1834 2.1268 6.1725 6.3463 4.3092 1.3322 5.7456 1.0897 5.4521 2.3151 7.3765 5.3647 5.0529 6.6474 7.4950 5.1929 8.4931 7.6998 6.8335 7.5430 5.6317 5.2343 6.1911 2.7932 3.8881 2.5797 4.6939 1.7712 3.4317 4.0588 4.2067 4.1978 6.1845 3.5360 4.2355 1.3000 5.0672 3.4977 3.2354 1.2833 3.4668 5.0256 4.5931 4.9643 5.1788 5.8759 6.1454 10.6326 5.5643 7.8325 5.4589 5.5207 7.4151 4.6800 4.9578 3.7779 1.9867 3.1621 5.0903 5.1725 6.6995 4.2866 3.8212 2.5432 2.4725 2.2328 1.9937 2.4837 2.9884 4.1552 1.7184 1.8246 1.6819 2.7145 5.4117 3.2816 2.9090 3.6756 3.2223 2.6891 3.3590 3.2411 1.9816 2.1391 1.1624 1.3564 2.0651 1.3643 1.3536 1.8510 1.3049 2.6752 2.0472 1.2274 1.3447 1.6560 1.5943 1.2681 1.4468 1.7116 4.1632 1.0934 1.0563 1.0563 1.0564 1.0545 1.0542 1.0481 5.7393 3.9406 1.7565 4.7468 3.9686 10.1537 9.2922 10.0415 1.0841 1.0379 1.0390 1.0385 1.0592 1.0856 1.0862 1.0872 1.0969 1.0934 1.0941 1.1061 1.1025 1.1024 1.1004 1.1018 1.0783 1.0454 1.1033
irintensity: 0.5042 3.0832 3.2600 3.5884 0.3575 2.0030 0.4083 0.9888 2.9837 1.4193 0.2499 5.8619 1.2607 5.2349 4.6011 3.2590 2.2761 0.6035 2.2149 4.7285 6.5810 8.4482 1.1532 5.2738 2.6056 5.8882 33.0331 2.8960 22.2644 6.0561 59.1803 5.1027 5.7129 8.5053 2.3585 8.4175 10.8658 16.9877 179.9931 12.0475 3.9887 4.4547 162.5231 1.8367 16.6565 11.2959 2.5824 2.2747 15.7399 0.5683 4.0127 11.7267 24.9591 10.0770 23.3703 15.4782 16.3372 17.9182 19.7982 6.6902 60.5443 26.7276 90.3138 42.2255 27.9179 65.4752 48.0893 45.8546 49.9941 22.8245 97.0865 104.7281 6.5341 11.6128 6.0782 15.6506 67.2457 105.7455 28.6957 2.5598 5.1838 9.8487 190.7669 686.2609 109.1920 66.8041 26.8955 14.6999 1.2992 20.3872 13.7029 0.5609 37.8856 9.8883 39.8604 51.7564 5.4127 7.0308 77.6939 15.4752 28.2867 40.3852 138.2734 32.7012 23.4123 14.4635 44.8313 12.2688 17.9012 9.7418 25.3120 364.8119 98.2786 7.4016 640.0681 277.6103 125.5518 196.3079 165.4279 21.6752 0.7750 0.6353 0.5699 21.1974 4.6721 13.7281 2.7614 4.4225 5.3639 8.4379 5.6485 5.8309 5.5653 5.9491 72.7934 84.6767 65.9722 38.5426
temp: 298.150 k
press: 1.00000 atm
elementType: 8 8 8 8 8 8 8 8 7 7 7 7 7 6 6 6 6 6 6 6 6 6 6 6 6 6 6 6 6 1 1 1 1 1 1 1 1 1 1 1 1 1 1 1 1 1 1 1
symmnumber: 1
zpe: 934594.6 jmol-1
zpe.correction: 0.355968 hartree
zpe.thermalcorrener: 0.385426 hartree
zpe.thermalcorrenthalpy: 0.386370 hartree
zpe.thermalcorrgfe: 0.290538 hartree
zpe.sumelectzpe: -1494.497758 hartree
zpe.sumelectthermal: -1494.468301 hartree
zpe.sumelectthermalent: -1494.467357 hartree
zpe.sumelectthermalfe: -1494.563189 hartree
dipole: -8.9170 -11.0379 -4.7441
dipole: 14.9618
quadrupole: -218.4222 -150.3425 -165.3664
quadrupole: -46.3117 -3.9674 3.7356
quadrupole: -40.3785 27.7012 12.6773 -46.3117 -3.9674 3.7356
hfenergy: -1494.8537267 hartree
pointgroup: C01 [X(C16H19N5O8)]
dipole: 3.1439041 -4.517311 2.0879709 debye
polarizability: 281.9460212|-1.6638436|264.5435882|10.6134307|-19.4811994|155.2194184 unknown
InChI: InChI=1S/C16H19N5O8/c1-6(22)26-4-9-11(27-7(2)23)12(28-8(3)24)15(29-9)21-5-18-10-13(21)19-16(17)20-14(10)25/h5,9,11-12,15,19H,4,17H2,1-3H3
charge 0 multiplicity 1
48 atoms
O  1.331645 0.949532 0.842167
O  -0.203574 -2.037242 -0.547297
O  2.197123 -2.203725 0.802701
O  3.77911 2.372117 0.166459
O  0.943096 -2.864545 -2.396339
O  4.511839 -2.23523 0.539396
O  -5.312392 2.385623 -0.752552
O  2.056987 3.527756 -0.913508
N  -0.940842 0.941578 0.128731
N  -2.798566 -0.672866 0.577449
N  -2.195073 2.706702 -0.602674
N  -5.008934 0.244807 0.17846
N  -4.747726 -1.961473 0.951139
C  0.683946 -0.862196 -0.56618
C  2.1620 -1.107723 -0.197395
C  0.184003 0.103768 0.533485
C  2.590409 0.242303 0.438963
C  3.386887 1.125409 -0.527548
C  -2.273952 0.552454 0.183564
C  -0.948744 2.276137 -0.375838
C  -3.047539 1.635182 -0.25834
C  0.016764 -2.992189 -1.573672
C  3.487191 -2.717503 1.066687
C  -4.51738 1.509884 -0.32379
C  -4.214336 -0.73758 0.557702
C  -1.007144 -4.096321 -1.496792
C  2.994596 3.515832 -0.08801
C  3.413744 -3.890234 2.012225
C  3.451331 4.665714 0.775502
H  0.636164 -0.381221 -1.560017
H  2.781746 -1.394249 -1.061217
H  -0.119935 -0.486625 1.424635
H  3.177927 0.077135 1.357839
H  2.80346 1.377766 -1.431533
H  4.333496 0.625124 -0.790314
H  -0.027749 2.832964 -0.532653
H  -2.220259 -1.518555 0.561939
H  -2.012528 -3.697412 -1.722592
H  -1.036616 -4.526071 -0.481053
H  -0.760184 -4.879825 -2.22683
H  3.277642 -4.81987 1.429347
H  2.5618 -3.792421 2.702313
H  4.357124 -3.974715 2.572259
H  4.543739 4.64777 0.912195
H  2.983577 4.575769 1.773069
H  3.131447 5.616958 0.325499
H  -5.764094 -2.018513 0.910416
H  -4.252826 -2.573377 1.597603
