program: Gaussian 09
title: 000064981
version: EM64L-G09RevD.01
frameworkgroup: C1[X(C21H24O6)]
method: RPBEPBE
basis: SDD
operation: Freq
keyword: #pfreq=noraman
keyword: PBEPBE/SDD
title: #p freq=noraman PBEPBE/SDD
converged: YES YES NO NO
title: Mulliken charges:
elementType: O O O O O O C C C C C C C C C C C C C C C C C C C C C H H H H H H H H H H H H H H H H H H H H H H H H
charge: -0.189126 -0.210232 -0.307784 -0.327954 -0.299923 -0.434770 -0.137201 -0.220828 -0.362195 -0.622762 -0.636557 0.170179 0.587609 0.562447 -0.549973 -0.432285 -0.502993 -0.426386 0.223260 -0.355019 0.236271 -0.340773 0.177969 0.117184 -0.540564 -0.532943 -0.531358 0.243896 0.284018 0.232804 0.222179 0.208056 0.235465 0.247222 0.213022 0.255907 0.233414 0.227775 0.245384 0.247467 0.253853 0.380870 0.225875 0.249054 0.257717 0.220025 0.243188 0.248880 0.230345 0.221978 0.258311
chargesum: 0.00000
title: Mulliken charges with hydrogens summed into heavy atoms:
elementType: O O O O O O C C C C C C C C C C C C C C C C C C C C C
charge: -0.189126 -0.210232 -0.307784 -0.327954 -0.299923 -0.053900 0.106695 0.063190 0.092788 -0.179241 -0.176313 0.170179 0.587609 0.562447 -0.294066 -0.198870 -0.275218 -0.181002 0.223260 -0.107552 0.236271 -0.086920 0.177969 0.117184 0.192081 0.179151 0.179276
polarizability: 2.98203124e+02 -1.59583907e+01 1.78907292e+02 -1.56845653e+00 -2.87856296e+01 2.33009218e+02
1716.lowfreq: -8.6531 -6.9299 -0.0003 0.0004 0.0006 4.9892 9.6179 26.2419 30.9165
frequency: 9.0657 25.9180 30.8144 40.0383 52.4785 56.7808 68.9554 80.1243 89.1272 113.9431 118.5922 133.6938 143.1848 155.7515 164.6788 168.3242 173.2591 185.5460 193.2852 212.8118 232.3256 250.6571 273.0354 286.8062 297.8393 307.2237 340.5638 348.4363 353.7409 387.4114 422.3160 441.6384 456.3694 471.3482 487.3561 490.5999 502.4384 530.3368 534.2585 537.5783 575.1852 605.0721 634.6022 643.3228 652.4694 690.2623 708.0238 715.4392 720.1407 741.3917 755.4979 772.8518 806.6371 819.3206 834.5773 841.8360 856.6930 868.5707 886.2330 901.6946 903.0927 928.3182 939.1361 942.2879 947.7941 950.7345 977.8482 990.4660 1007.0011 1020.0651 1058.5547 1074.0507 1092.9317 1108.5541 1112.6603 1114.9778 1115.6847 1121.7485 1139.3409 1141.8910 1152.5255 1155.5233 1157.3124 1159.6485 1166.7595 1187.4385 1196.2226 1211.6419 1216.1544 1224.2431 1245.5868 1256.1810 1263.8029 1271.9824 1297.9398 1305.8045 1317.0832 1318.4492 1332.9063 1343.2234 1366.1316 1399.5247 1411.6766 1423.3358 1425.2640 1443.6195 1448.5352 1457.7826 1461.3508 1466.4149 1469.9477 1470.2632 1473.6829 1477.1037 1481.0405 1485.3948 1488.4005 1507.5491 1570.7692 1608.7225 1612.5017 1620.7793 1697.1061 2965.2184 2974.5382 2982.6194 2984.7401 2986.3450 3009.1464 3025.2301 3044.3509 3045.2743 3055.1993 3057.4495 3072.5401 3083.9826 3091.8685 3116.2326 3123.4813 3126.2067 3127.0349 3134.2527 3140.2843 3143.4373 3153.0691 3168.1789 3507.3986
redmass: 5.0946 5.7531 5.7670 5.1806 4.9040 4.8933 5.1760 4.2835 3.1076 2.8860 3.7397 6.1054 4.2080 3.2569 1.7722 1.2560 2.0305 2.4762 1.5975 3.9663 2.8498 3.5814 2.9946 3.2132 4.0925 2.5220 3.5059 4.2286 3.9592 4.5322 4.5515 3.0733 4.9257 4.2152 3.7536 3.5516 1.1543 4.0691 5.1988 5.2127 4.4580 5.8565 5.6595 5.1501 5.2513 5.2421 5.9067 4.9163 4.1917 3.8121 3.8257 5.1281 2.0667 1.5527 1.6167 1.9913 2.4906 2.5881 3.3822 1.6498 2.9171 2.6916 1.4254 3.5234 3.3836 1.6067 3.4277 2.8031 4.3524 3.8175 2.2040 3.1105 2.5724 2.6200 1.2506 1.2581 1.8879 1.2646 1.5161 1.8465 1.2254 1.2860 1.4360 1.5120 1.0914 1.3776 1.8360 1.2568 1.9723 1.5318 2.0855 1.3210 2.2900 2.2957 1.3401 1.5553 1.6610 1.3257 1.4324 1.4461 6.0503 2.2247 3.7891 2.1121 1.1815 1.3752 1.5220 1.0553 1.0727 1.0509 1.1094 1.1043 1.0849 1.0982 1.0860 2.5468 1.0601 3.1026 7.2343 6.6365 6.7023 6.7726 12.5342 1.0324 1.0312 1.0600 1.0296 1.0613 1.0658 1.0839 1.0963 1.0936 1.0944 1.1044 1.1033 1.1047 1.1060 1.0886 1.1031 1.1035 1.1001 1.0895 1.0918 1.0906 1.0954 1.0956 1.0644
irintensity: 0.6186 0.5292 1.1045 0.3705 0.9881 0.9234 3.3504 1.9149 8.8708 4.4813 3.7948 1.5679 3.8702 1.1204 4.4057 0.8243 0.7794 8.8145 0.1059 2.0734 3.1484 7.7546 0.1984 3.5038 4.1237 1.1479 4.8772 1.3098 0.7797 0.6125 4.5815 12.7849 3.0346 0.8836 11.2740 7.8947 138.2167 4.7574 4.7970 20.9039 10.1771 16.8385 1.6818 14.1927 6.4201 2.0446 6.0726 6.4822 5.5377 5.1189 2.4973 15.3428 2.3632 78.8593 39.3043 2.4955 27.1185 5.7325 7.3087 13.2596 11.8389 19.4960 4.3438 34.8618 39.6110 17.4833 20.9386 67.2951 40.8296 0.9011 8.8504 139.7592 49.5431 63.2835 13.7824 6.5093 28.7475 1.8804 10.5871 23.7524 1.2575 2.1391 5.5418 53.3378 1.4951 148.1903 63.7801 4.0676 14.7690 20.7672 68.8042 6.8801 55.6193 57.2584 4.8238 19.9398 27.9203 10.3667 1.6661 1.2510 10.7405 16.7734 20.6288 28.6893 0.5848 12.6064 15.7874 13.4744 8.8853 12.9629 22.1623 13.4068 36.3196 5.0591 7.9600 98.7052 39.0934 108.7272 8.4460 12.1374 3.9351 13.6868 295.8661 47.0920 84.2880 35.2437 35.9274 26.5177 41.7695 15.9469 22.9075 1.7615 18.8125 33.7525 24.8120 15.2370 24.4273 12.3915 19.6520 23.5173 19.5182 6.4712 6.0726 10.4440 7.5519 4.7206 71.2898
temp: 298.150 k
press: 1.00000 atm
elementType: 8 8 8 8 8 8 6 6 6 6 6 6 6 6 6 6 6 6 6 6 6 6 6 6 6 6 6 1 1 1 1 1 1 1 1 1 1 1 1 1 1 1 1 1 1 1 1 1 1 1 1
symmnumber: 1
zpe: 1070962.9 jmol-1
zpe.correction: 0.407908 hartree
zpe.thermalcorrener: 0.434717 hartree
zpe.thermalcorrenthalpy: 0.435661 hartree
zpe.thermalcorrgfe: 0.348666 hartree
zpe.sumelectzpe: -1263.924901 hartree
zpe.sumelectthermal: -1263.898092 hartree
zpe.sumelectthermalent: -1263.897148 hartree
zpe.sumelectthermalfe: -1263.984143 hartree
dipole: -3.5239 -1.6657 5.8778
dipole: 7.0527
quadrupole: -177.4161 -163.7603 -148.3028
quadrupole: 5.2886 16.3436 -1.6936
quadrupole: -14.2564 -0.6005 14.8569 5.2886 16.3436 -1.6936
hfenergy: -1264.3328097 hartree
pointgroup: C01 [X(C21H24O6)]
dipole: 1.5336504 0.4853583 2.2608945 debye
polarizability: 296.2218786|-21.0149823|178.7074084|-0.8317696|27.5211042|235.1903469 unknown
InChI: InChI=1S/C21H24O6/c1-24-18-7-5-13(11-20(18)26-3)8-15-12-27-21(23)16(15)9-14-4-6-17(22)19(10-14)25-2/h4-7,10-11,15-16,22H,8-9,12H2,1-3H3
charge 0 multiplicity 1
51 atoms
O  -4.809183 1.273955 0.293603
O  -4.709063 0.203684 -1.764993
O  2.215359 1.427702 -2.284273
O  2.087048 -2.362075 1.637143
O  3.967969 1.487427 0.075009
O  2.705582 -3.343149 -0.766381
C  -2.485804 1.075982 0.994316
C  -2.733329 0.142047 -0.223652
C  -3.9285 1.36366 1.493964
C  -1.725678 2.388401 0.620878
C  -2.654108 -1.398747 0.076544
C  -4.151124 0.51081 -0.699942
C  -0.230099 2.173444 0.436693
C  -1.250696 -1.959143 -0.105829
C  0.338946 1.921252 -0.834867
C  0.62706 2.177402 1.569092
C  -0.285276 -1.895804 0.935877
C  -0.873569 -2.513945 -1.35342
C  1.720019 1.666226 -0.983838
C  2.013743 1.958839 1.42835
C  1.023151 -2.3617 0.711392
C  0.440037 -2.986991 -1.579839
C  2.574721 1.71411 0.156017
C  1.394123 -2.904569 -0.551954
C  2.820823 0.084714 -2.482175
C  1.870373 -1.707511 2.928081
C  4.709464 2.456311 -0.768011
H  -1.910715 0.558834 1.783536
H  -2.03399 0.352001 -1.050896
H  -4.058847 2.376056 1.908695
H  -4.283628 0.6137 2.224243
H  -1.886441 3.119572 1.43721
H  -2.178426 2.823922 -0.290859
H  -3.339866 -1.915045 -0.620049
H  -3.029878 -1.58559 1.101684
H  -0.277338 1.909964 -1.741159
H  0.21035 2.385932 2.562517
H  -0.562926 -1.47988 1.910299
H  -1.612774 -2.576049 -2.16018
H  2.691008 2.001012 2.288208
H  0.734004 -3.421836 -2.539808
H  3.222572 -3.192949 0.069956
H  3.205223 0.089141 -3.513202
H  3.639766 -0.091571 -1.762178
H  2.048125 -0.695984 -2.366577
H  1.082801 -2.227208 3.507222
H  2.830764 -1.781648 3.458922
H  1.599842 -0.644618 2.783206
H  5.752631 2.105704 -0.765759
H  4.649684 3.46733 -0.322367
H  4.307369 2.476778 -1.79645
