program: Gaussian 09
title: 000064908
version: EM64L-G09RevD.01
frameworkgroup: C1[X(C15H16N2O)]
method: RPBEPBE
basis: SDD
operation: Freq
keyword: #p
keyword: freq=noraman
keyword: PBEPBE/SDD
title: #p freq=noraman PBEPBE/SDD
converged: YES YES NO NO
title: Mulliken charges:
elementType: O N N C C C C C C C C C C C C C C C H H H H H H H H H H H H H H H H
charge: -0.271161 -0.378775 -0.503159 -0.352735 -0.568313 0.482195 0.451693 -0.446626 -0.398975 -0.395458 -0.405574 0.219502 -0.229318 -0.231050 -0.228735 -0.250640 -0.246000 -0.242528 0.267234 0.208200 0.249252 0.260129 0.238354 0.247728 0.237218 0.226501 0.225536 0.223552 0.223574 0.227653 0.228358 0.320739 0.307360 0.304268
chargesum: 0.00000
title: Mulliken charges with hydrogens summed into heavy atoms:
elementType: O N N C C C C C C C C C C C C C C C
charge: -0.271161 -0.058036 0.108468 -0.085500 -0.110861 0.482195 0.451693 -0.186497 -0.160621 -0.147729 -0.168356 0.219502 -0.002817 -0.005513 -0.005183 -0.027065 -0.018347 -0.014170
polarizability: 2.07446819e+02 -1.66223417e+01 1.53768358e+02 -1.33448938e+01 7.34647550e+00 1.46897018e+02
1716.lowfreq: -6.4890 -4.0221 -0.0009 -0.0006 0.0005 7.6299 24.1511 30.3955 45.0434
frequency: 23.4111 30.0703 44.9143 52.1146 61.7217 86.8594 125.2677 137.4675 179.1343 215.6243 222.1806 243.6151 272.5728 294.6267 360.5227 401.1247 404.7033 442.2834 467.3302 528.2621 558.0276 578.3147 610.9269 616.4964 624.4005 634.7886 704.4168 707.4723 712.8730 746.8789 766.3724 774.0436 790.6740 851.9121 856.2624 858.1567 917.7139 925.5028 949.2461 965.5549 976.4423 979.2929 990.1945 990.9558 994.9075 995.1344 1018.3090 1028.0405 1036.9404 1078.4909 1083.9165 1122.2210 1170.4858 1172.7005 1174.9737 1187.9014 1192.8726 1194.5821 1214.5899 1245.7156 1276.7008 1282.3755 1290.3352 1325.0313 1337.9516 1347.5137 1379.0612 1385.0997 1436.7194 1442.5691 1443.6912 1446.0932 1480.3002 1485.3016 1589.4610 1592.9298 1609.7123 1615.1764 1616.4310 1677.8844 2983.8899 3000.5102 3049.8251 3117.8134 3118.0353 3122.6519 3123.1604 3134.9734 3136.4049 3144.3622 3145.6457 3161.3568 3162.7790 3391.1976 3507.0525 3551.4596
redmass: 4.4610 4.6312 3.9007 5.1461 4.9346 4.4240 3.1450 1.3743 3.6542 3.9897 4.2377 5.0897 3.5500 4.2933 3.4560 2.8122 2.8327 3.4336 3.7053 2.8181 1.6205 3.2466 4.8696 6.4428 4.9062 2.5345 1.7862 1.7176 4.3091 2.7172 1.8082 1.7565 2.5208 1.2986 1.8868 1.7066 1.4465 1.4898 5.4538 2.2489 1.4006 1.4364 5.4667 5.6153 1.3152 1.3385 3.4298 2.1464 2.3996 1.6140 1.6343 2.1640 1.1199 1.0883 1.5936 1.1248 2.1249 1.1913 1.9311 1.4841 1.6760 1.3438 1.4127 1.4003 1.2943 1.4135 7.2380 6.2878 2.1559 2.0731 1.7486 1.1468 2.2477 2.2555 6.0419 5.9378 6.0481 6.0463 6.8025 1.0642 1.0599 1.0814 1.1023 1.0859 1.0849 1.0866 1.0871 1.0919 1.0915 1.0963 1.0959 1.1015 1.1015 1.0428 1.0985 1.0795
irintensity: 0.8975 0.9218 0.0980 2.1515 0.5031 1.7867 5.3032 19.2995 1.4805 5.7868 0.5766 10.1080 11.4470 3.8774 17.4073 0.2645 0.1209 2.4742 4.6271 75.1127 74.6602 25.2753 2.7304 0.5529 15.3137 26.4319 49.4044 59.2509 8.1654 19.4817 10.2946 150.6524 22.9217 0.2284 1.9753 2.7376 5.9843 2.8910 12.6399 10.3890 0.4371 0.1385 0.1444 1.0052 0.2140 0.5890 3.8068 11.4166 1.4180 9.9756 7.7280 16.5255 0.1789 0.3314 3.6959 1.1883 2.0230 1.1581 10.5585 0.7024 29.1697 0.6840 1.8490 11.6544 3.5631 7.8701 0.7941 0.2207 11.7712 27.5043 134.1260 18.0390 23.4307 18.1399 8.4145 0.6141 12.5071 7.6307 139.1042 27.2978 13.8068 5.4690 20.5664 6.6631 3.0870 0.7626 0.4256 13.9013 15.0865 31.1590 47.2483 29.3183 21.6259 0.1920 1.8670 30.1597
temp: 298.150 k
press: 1.00000 atm
elementType: 8 7 7 6 6 6 6 6 6 6 6 6 6 6 6 6 6 6 1 1 1 1 1 1 1 1 1 1 1 1 1 1 1 1
symmnumber: 1
zpe: 726755.1 jmol-1
zpe.correction: 0.276806 hartree
zpe.thermalcorrener: 0.293418 hartree
zpe.thermalcorrenthalpy: 0.294362 hartree
zpe.thermalcorrgfe: 0.230161 hartree
zpe.sumelectzpe: -764.616794 hartree
zpe.sumelectthermal: -764.600182 hartree
zpe.sumelectthermalent: -764.599238 hartree
zpe.sumelectthermalfe: -764.663439 hartree
dipole: 0.4607 0.3451 -2.1314
dipole: 2.2078
quadrupole: -99.7977 -103.3072 -103.8352
quadrupole: -2.8842 -1.4617 6.3872
quadrupole: 2.5157 -0.9939 -1.5218 -2.8842 -1.4617 6.3872
hfenergy: -764.8936003 hartree
pointgroup: C01[X(C15H16N2O1)]
dipole: -0.1087569 -0.0472737 -0.8604766 debye
polarizability: 204.1714162|-18.4077252|156.0138651|16.534815|-8.4020458|147.926914 unknown
InChI: InChI=1S/C15H16N2O/c16-17-15(18)11-14(12-7-3-1-4-8-12)13-9-5-2-6-10-13/h1-10,14,17H,11,16H2
charge 0 multiplicity 1
34 atoms
O  2.220211 1.742781 1.733043
N  3.108895 1.815867 -0.409546
N  4.464298 1.865413 0.014672
C  -0.199516 0.545697 0.441667
C  0.657143 1.693147 -0.171898
C  0.398465 -0.822516 0.067654
C  -1.688099 0.64625 0.085414
C  1.288122 -1.477114 0.957581
C  -2.62342 -0.085749 0.864424
C  0.113386 -1.431711 -1.181898
C  -2.17887 1.420541 -0.995699
C  2.042159 1.747127 0.47655
C  1.883087 -2.710333 0.605491
C  -4.00359 -0.044611 0.576557
C  0.709518 -2.66206 -1.536952
C  -3.56232 1.464865 -1.289639
C  1.598232 -3.306483 -0.644339
C  -4.480729 0.732922 -0.505818
H  -0.102482 0.6610 1.539107
H  0.740185 1.578192 -1.269584
H  0.159994 2.661705 0.030892
H  1.518225 -1.011787 1.923545
H  -2.26022 -0.694231 1.70198
H  -0.595539 -0.951782 -1.8674
H  -1.488536 2.002555 -1.616119
H  2.564593 -3.205536 1.306738
H  -4.706719 -0.614357 1.194664
H  0.47493 -3.122786 -2.503555
H  -3.920301 2.072405 -2.128841
H  2.056376 -4.263931 -0.917036
H  -5.552411 0.768496 -0.731302
H  2.966583 1.758139 -1.41892
H  4.687161 1.036528 0.585316
H  4.635591 2.724558 0.556352
