program: Gaussian 09
title: 000064913
version: EM64L-G09RevD.01
frameworkgroup: C1[X(C18H18O4S2)]
method: RPBEPBE
basis: SDD
operation: Freq
keyword: #p
keyword: freq=noraman
keyword: PBEPBE/SDD
title: #p freq=noraman PBEPBE/SDD
converged: YES YES NO NO
title: Mulliken charges:
elementType: S S O O O O C C C C C C C C C C C C C C C C C C H H H H H H H H H H H H H H H H H H
charge: 0.019261 0.019327 -0.411344 -0.411444 -0.238085 -0.237911 -0.646438 -0.645912 0.539940 0.539955 -0.420683 -0.421017 -0.416625 -0.416250 -0.346873 -0.347004 0.202913 0.202825 -0.215891 -0.215948 -0.230765 -0.230759 -0.237314 -0.237304 0.309126 0.309027 0.262800 0.276075 0.262843 0.276252 0.241621 0.241537 0.243432 0.243253 0.230513 0.230519 0.228430 0.228433 0.231727 0.231729 0.378014 0.378019
chargesum: 0.00000
title: Mulliken charges with hydrogens summed into heavy atoms:
elementType: S S O O O O C C C C C C C C C C C C C C C C C C
charge: 0.019261 0.019327 -0.033330 -0.033425 -0.238085 -0.237911 -0.337313 -0.336885 0.539940 0.539955 0.118192 0.118077 -0.175005 -0.174714 -0.103441 -0.103751 0.202913 0.202825 0.014622 0.014571 -0.002335 -0.002326 -0.005587 -0.005576
polarizability: 3.72369955e+02 4.40420763e+01 2.03533394e+02 3.32509651e-02 -1.06175433e-01 2.08240639e+02
1716.lowfreq: -4.2407 0.0011 0.0025 0.0027 5.5724 9.6100 16.7536 20.8462 21.2690
frequency: 16.6896 20.2062 20.9917 31.4665 33.8722 35.2690 36.2797 45.8775 49.6461 71.6624 76.7497 104.5054 139.2906 157.7877 171.8302 194.6325 211.5617 227.5458 242.0066 288.5556 291.6055 333.7256 337.8392 402.6345 402.7067 414.5065 452.8993 454.4210 504.4007 505.4020 532.1322 532.4806 562.2643 563.8277 573.5019 574.7050 616.0958 616.1358 654.3892 654.9159 696.7532 697.0345 701.8499 702.5629 767.8594 767.9096 787.3239 787.9167 849.8708 849.9886 873.8387 874.0624 925.2724 925.5743 961.2405 961.5523 977.3262 977.3683 990.0966 990.2160 998.0667 998.0885 1022.7734 1023.7284 1037.5055 1038.7557 1070.1507 1071.1783 1092.9269 1094.4873 1162.8840 1173.2903 1174.0011 1174.8737 1180.8636 1181.8055 1191.1547 1191.2922 1214.1968 1215.6124 1260.6173 1262.6011 1304.5407 1306.0503 1334.5647 1337.8550 1363.6699 1364.3389 1388.8089 1389.1146 1441.2734 1441.5735 1443.7835 1444.1074 1481.4894 1481.5832 1591.3199 1591.5947 1609.3732 1609.4652 1657.9599 1659.7592 2973.6313 2973.9801 3067.8295 3068.2497 3095.0168 3095.3996 3124.3071 3124.3303 3128.7242 3128.7394 3139.5428 3139.5490 3150.6959 3150.7234 3166.3802 3166.4821 3508.2489 3508.3554
redmass: 7.6937 6.9971 7.0663 5.7503 8.9603 5.0238 4.2399 6.0806 7.4007 6.9367 6.4216 5.1582 7.6921 10.1616 5.1495 3.6033 4.5407 4.8232 7.4512 6.2646 6.3943 4.6338 5.0471 2.7873 2.7960 25.0171 3.4917 3.4968 3.3623 3.3283 2.3310 2.3364 4.0214 4.0434 3.7614 3.7619 6.0916 6.0678 1.5326 1.5336 4.4564 4.2443 1.5868 1.6442 3.4760 3.4777 2.3583 2.3954 1.2515 1.2510 4.3806 4.3723 1.4438 1.4465 2.1758 2.1977 1.4118 1.4118 5.8383 5.8553 1.3278 1.3279 2.7394 2.6310 2.5417 2.6137 1.9618 1.9203 1.8809 1.9372 1.1743 1.0925 1.0626 1.1455 1.1842 1.1768 1.1209 1.1260 2.2338 2.2369 1.5392 1.5589 1.5249 1.4937 1.5454 1.5357 1.7804 1.7859 4.7206 4.8542 1.2190 1.1835 1.7455 1.8261 2.2852 2.2846 5.9579 5.9430 6.0651 6.0617 8.4146 8.4702 1.0679 1.0680 1.0862 1.0864 1.0912 1.0913 1.0852 1.0852 1.0878 1.0878 1.0922 1.0922 1.0965 1.0965 1.1017 1.1017 1.0639 1.0639
irintensity: 0.0376 0.3063 0.1625 0.0505 2.5203 0.0261 0.4581 0.6462 0.3769 0.4699 0.0046 1.1103 3.8968 0.0401 9.6580 0.1391 0.1433 0.2513 0.1784 2.7878 1.2978 8.2046 0.3634 0.4508 0.0600 0.0037 11.7363 2.1405 0.2635 10.7061 60.9728 46.9635 1.8748 38.3786 77.3054 9.3014 2.8286 0.1651 14.4902 177.4120 12.7868 8.4947 159.4545 23.5833 18.0515 14.5881 14.6103 8.0165 0.1086 0.0185 2.4932 0.8862 0.4654 0.8089 32.0568 2.6334 0.2515 0.1925 7.3734 0.4263 0.0108 0.0438 82.2222 0.6512 319.8181 4.5539 169.6195 9.1492 73.8259 10.3557 7.8080 0.0033 1.0184 0.0285 3.4312 0.8145 0.0477 3.3015 0.5250 17.1931 10.7702 0.0162 41.6442 0.2003 108.3468 4.9188 84.6879 2.7908 2.6697 1.1776 9.8905 15.7065 9.6166 38.6690 21.4283 0.0530 0.3803 2.9254 0.1787 0.0681 46.4730 278.5065 50.0712 7.2508 1.1605 0.7801 2.8494 3.8083 8.7602 0.7748 0.0528 0.0015 20.4266 7.3536 15.8409 44.4663 56.8813 1.2215 29.1374 18.6430
temp: 298.150 k
press: 1.00000 atm
elementType: 16 16 8 8 8 8 6 6 6 6 6 6 6 6 6 6 6 6 6 6 6 6 6 6 1 1 1 1 1 1 1 1 1 1 1 1 1 1 1 1 1 1
symmnumber: 1
zpe: 837421.2 jmol-1
zpe.correction: 0.318957 hartree
zpe.thermalcorrener: 0.343167 hartree
zpe.thermalcorrenthalpy: 0.344112 hartree
zpe.thermalcorrgfe: 0.258578 hartree
zpe.sumelectzpe: -1792.015444 hartree
zpe.sumelectthermal: -1791.991234 hartree
zpe.sumelectthermalent: -1791.990289 hartree
zpe.sumelectthermalfe: -1792.075823 hartree
dipole: 0.0042 0.0013 -0.1311
dipole: 0.1312
quadrupole: -127.7675 -143.5885 -159.5113
quadrupole: 1.8042 0.0432 -0.0013
quadrupole: 15.8549 0.0340 -15.8889 1.8042 0.0432 -0.0013
hfenergy: -1792.3344009 hartree
pointgroup: C01 [X(C18H18O4S2)]
dipole: -0.0016511 0.0005476 0.0515962 debye
polarizability: 372.595686|-43.60665|203.3078383|0.0195012|0.121519|208.240464 unknown
InChI: InChI=1S/C18H18O4S2/c19-17(20)11-15(13-7-3-1-4-8-13)23-24-16(12-18(21)22)14-9-5-2-6-10-14/h1-10,15-16,19,21H,11-12H2
charge 0 multiplicity 1
42 atoms
S  -0.98786 0.558868 1.628016
S  0.987841 -0.557413 1.627556
O  -3.251917 -3.810571 -0.220552
O  3.24349 3.813216 -0.229481
O  -2.403585 -2.372038 -1.833543
O  2.404844 2.366113 -1.839924
C  -1.974355 -0.359883 0.234858
C  1.973496 0.359247 0.232124
C  -3.296065 0.38035 0.132823
C  3.29462 -0.382218 0.131108
C  -2.079294 -1.858511 0.567492
C  2.078611 1.858193 0.562205
C  -3.591262 1.143288 -1.026071
C  3.586633 -1.151775 -1.024241
C  -4.247195 0.334548 1.187635
C  4.248024 -0.331643 1.18362
C  -2.575111 -2.653164 -0.626554
C  2.572847 2.651392 -0.633466
C  -4.817569 1.83476 -1.137155
C  4.811966 -1.845085 -1.134146
C  -5.470574 1.030074 1.078744
C  5.470544 -1.028924 1.075908
C  -5.760645 1.780776 -0.084548
C  5.757366 -1.786273 -0.083843
H  -1.394842 -0.2295 -0.692663
H  1.393539 0.227197 -0.694884
H  -2.727643 -2.049781 1.43708
H  -1.069014 -2.242996 0.821632
H  2.727898 2.05117 1.430754
H  1.068753 2.243195 0.817352
H  -2.863868 1.179352 -1.845295
H  2.85747 -1.191572 -1.84172
H  -4.027249 -0.236568 2.09722
H  4.03075 0.244595 2.090602
H  -5.037376 2.412069 -2.041943
H  5.02931 -2.427556 -2.036214
H  -6.19582 0.989227 1.898999
H  6.197585 -0.984246 1.894369
H  -6.711461 2.318627 -0.169487
H  6.707457 -2.325542 -0.167904
H  -3.531565 -4.325681 -1.026226
H  3.522026 4.32738 -1.036137
