program: Gaussian 09
title: 000006087
version: EM64L-G09RevD.01
frameworkgroup: C1[X(C17H20N2O6S)]
method: RPBEPBE
basis: SDD
operation: Freq
keyword: #p
keyword: freq=noraman
keyword: PBEPBE/SDD
title: #p freq=noraman PBEPBE/SDD
converged: YES YES NO NO
title: Mulliken charges:
elementType: S O O O O O O N N C C C C C C C C C C C C C C C C C H H H H H H H H H H H H H H H H H H H H
charge: 0.186442 -0.166132 -0.416475 -0.196416 -0.280339 -0.332532 -0.286944 -0.111679 -0.375167 -0.452632 -0.143566 -0.084277 -0.164934 0.100104 -0.656957 -0.695397 0.152565 0.195923 -0.033556 0.291922 0.256098 -0.377745 -0.381273 -0.199776 -0.528990 -0.518446 0.312554 0.290039 0.307482 0.254100 0.238936 0.222451 0.226629 0.237227 0.245973 0.366168 0.386324 0.243762 0.251328 0.229711 0.251915 0.226938 0.230270 0.228904 0.268590 0.200877
chargesum: 0.00000
title: Mulliken charges with hydrogens summed into heavy atoms:
elementType: S O O O O O O N N C C C C C C C C C C C C C C C C C
charge: 0.186442 -0.166132 -0.030150 -0.196416 -0.280339 -0.332532 -0.286944 -0.111679 -0.008999 -0.140078 -0.143566 0.205762 0.142548 0.100104 0.058531 0.014432 0.152565 0.195923 -0.033556 0.291922 0.256098 -0.133983 -0.129946 0.029935 0.180133 0.179925
polarizability: 3.25241177e+02 1.11212052e+01 2.40640280e+02 1.00214489e+00 9.07341873e+00 1.57881257e+02
1716.lowfreq: -11.6953 -5.6446 -2.4232 -0.0008 0.0007 0.0011 12.2365 22.5887 30.1822
frequency: 9.0778 22.4384 30.0923 44.6196 48.2612 60.4707 61.9527 87.1676 98.2598 101.8892 113.7788 129.8570 143.1230 157.1128 163.2540 193.7063 212.2160 218.1581 229.8569 239.7368 252.3966 261.9831 267.0840 283.3312 286.6265 292.8226 310.1454 339.5895 354.6298 360.2178 367.2447 405.7666 430.0449 470.2966 485.0422 499.0196 507.7198 522.7433 525.3272 579.2296 586.1556 605.0300 623.7242 628.7714 635.9787 665.8065 680.4614 693.7254 706.8112 727.1927 754.4346 768.0144 803.6240 806.8432 835.4122 852.9391 860.1598 872.0489 901.7835 930.4837 940.6075 950.1877 962.3071 968.9759 993.3384 1008.0835 1031.7920 1048.1121 1059.5876 1065.6921 1098.6556 1103.8595 1115.2926 1125.6580 1146.3622 1151.7384 1155.0809 1164.4345 1182.4611 1185.2629 1195.4651 1213.9075 1216.7435 1228.1917 1233.4627 1247.6175 1264.7355 1277.0302 1281.0194 1329.7119 1359.6106 1360.0788 1380.7846 1398.4563 1410.7238 1429.0991 1442.3152 1448.0490 1452.9162 1458.9788 1462.2868 1470.2213 1474.3433 1477.4724 1479.7483 1484.0358 1497.6599 1570.0859 1594.9059 1602.3029 1681.2313 1732.8226 2963.4870 2971.7528 2979.9622 2986.1356 3022.6048 3049.2982 3066.3140 3075.3530 3076.6340 3083.7441 3092.5448 3100.9170 3104.5176 3125.7217 3129.7221 3139.6564 3165.5758 3177.5159 3468.6175 3513.4520
redmass: 4.7958 6.5924 6.0442 5.1599 6.0398 5.6022 10.2231 4.5957 3.7186 7.2270 3.9039 6.7998 3.4254 1.5810 2.1823 4.1168 2.1686 3.6231 2.8596 1.9556 1.5077 2.0733 5.4606 3.4855 2.7195 1.4047 6.5289 4.0967 5.1054 4.5799 4.0023 7.0687 5.5436 4.7752 5.5028 5.3147 5.6177 5.9338 3.9444 3.7722 3.1754 4.2846 1.8728 3.5510 4.3108 1.7453 3.2981 3.4489 5.8025 3.3296 1.9196 5.3946 4.3968 4.6543 5.3806 4.7595 4.7514 1.6152 4.8482 2.4205 1.6494 2.9156 1.4678 5.3266 3.7811 1.4460 3.0530 4.4499 2.7377 5.1729 1.9485 1.2662 1.2546 1.7791 1.5009 1.3189 1.3574 2.0133 2.3147 1.2048 2.3100 1.6432 1.5913 2.3296 3.2150 1.7455 2.9877 2.8321 1.8603 1.7178 2.6365 2.5996 1.1937 1.1960 1.3981 1.5114 1.8346 1.2273 1.5213 1.0501 1.0472 1.0550 1.0847 1.0502 1.0495 1.0562 1.9555 5.8839 6.5973 5.7131 9.0437 12.7170 1.0349 1.0319 1.0380 1.0355 1.0841 1.0831 1.1047 1.0964 1.0975 1.0990 1.1007 1.0909 1.1002 1.1037 1.1009 1.0872 1.0925 1.0975 1.0792 1.0642
irintensity: 0.0365 0.6638 0.6234 0.5958 0.1701 5.2651 3.8078 4.2089 3.0386 3.9166 4.0897 1.3878 3.4901 4.2291 3.7057 5.8559 4.3934 0.8226 1.9371 2.1102 0.4761 7.5309 4.6544 2.2035 1.4474 1.0735 0.7372 0.0178 22.5671 3.0068 17.6911 9.7280 6.4025 7.5163 13.6178 25.5864 1.3510 2.5705 27.9359 6.3821 58.5288 21.2586 61.6167 16.3568 31.7023 31.4201 4.4048 47.2646 39.8775 23.5065 21.4353 2.8897 22.8823 19.8941 15.0491 12.5429 5.5095 3.0252 31.9057 1.5619 6.4587 18.4721 1.0693 22.4543 14.0176 9.9718 165.8809 62.4360 267.9205 141.7689 0.7028 16.9495 0.1300 66.5016 15.3522 3.5194 4.0128 8.3763 20.0365 6.4352 39.5224 63.3152 29.9103 3.8997 8.0324 10.9673 2.1131 326.1292 35.4954 22.2644 17.3852 11.2298 29.6521 14.6251 20.1978 11.5761 16.5191 20.3010 65.1021 0.4867 6.9367 11.7630 7.8802 13.2349 6.0484 9.9020 548.5831 54.9883 71.2879 299.4151 204.5229 368.4332 95.7225 53.3982 22.1147 19.0080 6.0057 38.5823 32.8858 13.8992 25.1718 16.6241 16.1247 10.2032 18.0998 20.2123 14.6790 6.8002 10.3644 12.6233 74.9279 33.4975
temp: 298.150 k
press: 1.00000 atm
elementType: 16 8 8 8 8 8 8 7 7 6 6 6 6 6 6 6 6 6 6 6 6 6 6 6 6 6 1 1 1 1 1 1 1 1 1 1 1 1 1 1 1 1 1 1 1 1
symmnumber: 1
zpe: 921200.6 jmol-1
zpe.correction: 0.350867 hartree
zpe.thermalcorrener: 0.377406 hartree
zpe.thermalcorrenthalpy: 0.378350 hartree
zpe.thermalcorrgfe: 0.291650 hartree
zpe.sumelectzpe: -1616.748126 hartree
zpe.sumelectthermal: -1616.721587 hartree
zpe.sumelectthermalent: -1616.720642 hartree
zpe.sumelectthermalfe: -1616.807342 hartree
dipole: 1.2151 7.2824 -1.8420
dipole: 7.6094
quadrupole: -121.6020 -152.5504 -170.1822
quadrupole: -0.8610 2.7844 6.9770
quadrupole: 26.5095 -4.4389 -22.0706 -0.8610 2.7844 6.9770
hfenergy: -1617.0989926 hartree
pointgroup: C01 [X(C17H20N2O6S1)]
dipole: -0.1512802 2.9681346 0.3605905 debye
polarizability: 321.7596721|-20.2950368|240.5766491|0.6120301|-19.2440444|161.4263927 unknown
InChI: InChI=1S/C17H20N2O6S/c1-17(2)12(16(22)23)19-14(21)11(15(19)26-17)18-13(20)10-8(24-3)6-5-7-9(10)25-4/h5-7,11-12,15,18,22H,1-4H3
charge 0 multiplicity 1
46 atoms
S  -1.651043 1.550731 0.732872
O  -1.710338 -1.650156 -2.155116
O  -6.100495 0.218699 -1.018977
O  -5.454618 -1.328583 0.595061
O  1.844656 -2.008533 1.229849
O  1.97112 1.726166 -0.412219
O  4.320389 -2.512535 0.004076
N  -2.685474 -0.763793 -0.111166
N  0.656813 -0.573848 -0.153938
C  -1.717009 -0.342884 0.932756
C  -3.551445 1.527077 0.287981
C  -3.762693 0.147421 -0.492625
C  -0.602965 -1.176478 0.17988
C  -1.677694 -1.306901 -0.96334
C  -4.350794 1.593895 1.607527
C  -3.853619 2.728619 -0.624676
C  -5.150991 -0.435264 -0.215268
C  1.845189 -1.047744 0.397563
C  3.117483 -0.364506 -0.043473
C  3.194603 1.028195 -0.371687
C  4.33449 -1.112188 -0.094579
C  4.428449 1.661271 -0.643805
C  5.571364 -0.483839 -0.376633
C  5.615606 0.898193 -0.633905
C  1.984598 3.173871 -0.641782
C  4.675947 -3.089966 1.317232
H  -1.955217 -0.613495 1.969801
H  -3.694413 0.337494 -1.580434
H  -0.397476 -2.130492 0.696501
H  -4.153157 0.722975 2.255751
H  -4.076214 2.50598 2.162747
H  -5.438275 1.632374 1.402811
H  -3.695195 3.680304 -0.087306
H  -3.21166 2.723051 -1.522789
H  -4.909291 2.690192 -0.951018
H  0.684849 0.311857 -0.671241
H  -7.003864 -0.158276 -0.836404
H  4.470927 2.728377 -0.875771
H  6.472052 -1.102975 -0.4263
H  6.571502 1.38517 -0.854537
H  0.929155 3.476365 -0.578377
H  2.388049 3.415339 -1.643394
H  2.572233 3.691968 0.138726
H  4.746952 -4.174708 1.146171
H  3.872986 -2.866779 2.039538
H  5.651328 -2.698139 1.669415
