program: Gaussian 09
title: 000064830
version: EM64L-G09RevD.01
frameworkgroup: C1[X(C10H10ClNO)]
method: RPBEPBE
basis: SDD
operation: Freq
keyword: #p
keyword: freq=noraman
keyword: PBEPBE/SDD
title: #p freq=noraman PBEPBE/SDD
converged: YES YES NO NO
title: Mulliken charges:
elementType: Cl O N C C C C C C C C C C H H H H H H H H H H
charge: -0.022009 -0.264414 -0.002447 -0.542372 0.471175 -0.380210 -0.369771 -0.420126 0.324455 -0.348259 -0.355627 -0.040633 -0.537899 0.251828 0.247780 0.234977 0.239305 0.319351 0.253182 0.245508 0.222763 0.225555 0.247889
chargesum: 0.00000
title: Mulliken charges with hydrogens summed into heavy atoms:
elementType: Cl O N C C C C C C C C C C
charge: -0.022009 -0.264414 -0.002447 -0.042763 0.471175 -0.145234 -0.130466 -0.100775 0.324455 -0.095077 -0.110119 -0.040633 0.158307
polarizability: 1.88900885e+02 1.27846282e+01 1.17301254e+02 -1.00308899e+01 9.60091761e+00 7.52603220e+01
1716.lowfreq: -5.9720 -2.6860 0.0014 0.0021 0.0024 5.9864 31.3398 43.7166 52.5448
frequency: 31.1872 43.7147 52.5247 101.3757 140.6095 185.3273 188.1168 228.3692 230.4038 241.6209 336.0812 360.9114 414.5747 431.5133 454.2294 509.2562 526.4625 555.8943 632.5269 669.0945 711.2013 755.2296 808.6784 821.3512 832.6928 843.4982 945.5418 964.8693 979.1653 985.2835 1003.0760 1052.4311 1111.8507 1112.9046 1153.3292 1157.2334 1183.3159 1187.5313 1214.5099 1235.3454 1303.9462 1306.6613 1318.1494 1385.4048 1421.8609 1436.2098 1466.8650 1470.3644 1472.1845 1503.1883 1583.5838 1623.3319 2195.3921 2963.5660 3022.7171 3053.3079 3075.4261 3092.8537 3122.3288 3130.0308 3132.8979 3168.4946 3171.1832
redmass: 5.4180 5.8049 5.5993 4.0596 6.5925 7.2844 2.9663 2.1097 7.6226 1.8234 2.8913 4.5613 2.9591 4.9163 11.6907 3.4549 4.0203 3.2716 6.6051 5.8061 3.8086 4.3807 2.7661 1.4036 3.1675 1.8913 1.3669 1.3605 2.1308 6.9525 2.7156 4.1627 1.2594 1.3543 1.2121 1.2290 1.2355 1.1343 2.3210 3.9090 1.3666 1.3379 1.3394 4.6149 3.3283 1.1737 1.0502 1.1016 1.0710 2.4347 6.9199 6.3552 12.5184 1.0329 1.0601 1.1042 1.0904 1.0996 1.0899 1.0988 1.0905 1.0940 1.0950
irintensity: 2.0448 1.9784 0.9615 4.1333 5.6836 5.1325 0.8833 1.4238 3.3509 1.0013 1.3487 7.3032 0.0710 6.0914 20.0207 17.0191 17.2528 21.7028 0.9939 48.6178 5.7361 41.6851 26.4226 0.4210 8.7496 41.1767 0.6927 0.4146 19.5577 33.3835 7.1015 8.1582 0.1975 15.4708 3.5867 7.9455 55.1298 11.7609 1.6468 189.4290 1.5137 1.2356 0.8709 9.6174 2.0961 10.1623 14.3528 22.0553 47.1881 99.4180 12.1990 82.2839 0.0888 62.6726 12.7665 45.5859 2.0618 5.6512 12.5772 30.3449 4.2428 10.8630 4.0385
temp: 298.150 k
press: 1.00000 atm
elementType: 17 8 7 6 6 6 6 6 6 6 6 6 6 1 1 1 1 1 1 1 1 1 1
symmnumber: 1
zpe: 459442.5 jmol-1
zpe.correction: 0.174992 hartree
zpe.thermalcorrener: 0.187856 hartree
zpe.thermalcorrenthalpy: 0.188800 hartree
zpe.thermalcorrgfe: 0.133883 hartree
zpe.sumelectzpe: -976.119602 hartree
zpe.sumelectthermal: -976.106738 hartree
zpe.sumelectthermalent: -976.105794 hartree
zpe.sumelectthermalfe: -976.160711 hartree
dipole: 3.3276 -1.5447 0.9261
dipole: 3.7837
quadrupole: -82.2845 -87.4773 -82.8922
quadrupole: 14.1071 0.8983 5.2289
quadrupole: 1.9335 -3.2593 1.3258 14.1071 0.8983 5.2289
hfenergy: -976.2945944 hartree
pointgroup: C01 [X(C10H10Cl1N1O1)]
dipole: 1.3575101 -0.5167151 0.3259187 debye
dipolederiv: -0.8532334 -0.1684041 -0.0240566 -0.1487556 -0.2713156 0.0124415 0.0066776 0.0390912 -0.1525696 -1.7190348 -0.4731994 0.0744407 -0.428486 -0.4647482 0.013669 0.1968987 0.0527496 -0.3143638 -0.2282666 0.0222058 -0.0000887 0.03798 -0.1714168 0.0397591 0.0074942 -0.0106432 -0.1991922 0.0595128 -0.0487141 -0.0186422 -0.0780342 0.0536592 -0.0082585 0.0968932 -0.0284967 0.1281206 -0.0725916 -0.0342751 -0.0272471 0.1121902 -0.1567635 -0.0194019 -0.1152091 0.001805 -0.1510531 0.1503106 0.0064019 -0.086924 -0.0151917 0.0590038 0.1015078 -0.1598555 0.1132994 -0.0681495 0.1454712 0.0847522 -0.015925 0.0840597 0.0782063 0.120663 -0.053425 0.0625465 -0.0548025 1.1184315 0.2012996 -0.0010797 0.1255837 0.3961331 -0.03039 0.0240923 -0.0333133 0.285854 1.5684824 0.3758723 -0.1693296 0.1874049 0.0992679 -0.0540302 -0.3611642 -0.1221178 0.1276123 -0.3856011 -0.0585255 -0.0025144 -0.3346383 -0.0776942 0.1220075 -0.1142411 0.0681966 -0.0899454 -0.4345289 -0.0649717 -0.0103785 0.244689 -0.0227155 0.0400049 0.225276 0.1184293 -0.1645188 -0.067257 0.0169426 0.0012558 0.0041083 -0.0523749 -0.0058419 -0.036721 0.0287138 -0.0667536 0.5642091 0.1696276 0.0443291 0.4964286 0.5066152 -0.0118724 0.2133148 0.0579811 0.3009498 0.0021691 -0.0019014 0.0348207 0.0440477 0.0646629 -0.0830671 0.0380298 -0.0315202 -0.0441898 0.0084171 -0.0008967 0.0057756 -0.0483397 -0.0899529 0.0212911 -0.0236423 -0.006005 0.0812632 0.0444333 -0.1082052 -0.0206486 -0.0868975 -0.0276501 -0.0744563 -0.0170551 -0.0648239 0.1044362 0.0287233 0.0539216 0.0785373 0.0620964 0.0317784 -0.0711798 0.0762748 -0.0684589 0.0742502 0.016692 -0.0183165 0.0526074 -0.0241493 0.0231001 -0.0047581 0.041233 -0.0043812 0.0075915 0.0411706 0.0509357 0.0649311 0.0434753 0.0567248 -0.0796544 0.0748704 -0.0800798 0.1026958 0.0431578 -0.0780146 -0.0165174 -0.1038164 -0.0030987 -0.0758465 -0.0117248 -0.0744885 0.1245003 0.0755817 -0.0085817 0.0338405 -0.1127959 0.0134592 0.0051791 -0.1088702 -0.0487959 -0.1664206 0.0327546 0.1140023 -0.0588619 -0.0653519 -0.1398869 0.0625361 -0.0873715 0.0376618 0.0419728 -0.1390036 -0.0319557 0.0616756 0.0043927 0.0950063 -0.0203019 0.088225 -0.0073499 0.0927125 unknown
polarizability: 186.1171662|19.5652629|118.5503924|-9.527888|11.8599825|76.7949028 unknown
InChI: InChI=1S/C10H10ClNO/c1-13-10-4-2-8(3-5-10)6-9(11)7-12/h2-5,9H,6H2,1H3
charge 0 multiplicity 1
23 atoms
Cl -4.542721 -0.896234 -0.090645
O  3.727814 -0.007728 -0.452841
N  -2.699584 2.322363 -0.42015
C  -1.833655 -0.939254 0.745496
C  -0.361009 -0.671073 0.466645
C  0.400458 -1.577187 -0.321549
C  0.278898 0.492112 0.956689
C  -2.731327 -0.335566 -0.366479
C  2.377656 -0.158638 -0.110237
C  1.753791 -1.331066 -0.609313
C  1.637838 0.757451 0.678479
C  -2.722175 1.129537 -0.405217
C  4.421513 1.191756 0.027909
H  -2.148036 -0.517434 1.715581
H  -2.03911 -2.023782 0.770271
H  -0.06959 -2.492237 -0.703333
H  -0.288676 1.206952 1.56427
H  -2.475376 -0.746698 -1.35606
H  2.348766 -2.026037 -1.209175
H  2.10023 1.665884 1.074363
H  4.441104 1.228212 1.134291
H  3.951319 2.112704 -0.36748
H  5.446874 1.102664 -0.358618
