program: Gaussian 09
title: 000064829
version: EM64L-G09RevD.01
frameworkgroup: C1[X(C11H13NO5)]
method: RPBEPBE
basis: SDD
operation: Freq
keyword: #p
keyword: freq=noraman
keyword: PBEPBE/SDD
title: #p freq=noraman PBEPBE/SDD
converged: YES YES NO NO
title: Mulliken charges:
elementType: O O O O O N C C C C C C C C C C C H H H H H H H H H H H H H
charge: -0.292184 -0.415312 -0.232689 -0.437755 -0.266654 -0.547321 -0.561761 0.385291 -0.220697 0.099138 -0.403076 0.152290 -0.243388 -0.323995 0.182141 0.095774 -0.525936 0.240625 0.242227 0.261817 0.245127 0.233377 0.278218 0.278007 0.282947 0.277627 0.216213 0.236929 0.381012 0.382010
chargesum: 0.00000
title: Mulliken charges with hydrogens summed into heavy atoms:
elementType: O O O O O N C C C C C C C C C C C
charge: -0.292184 -0.034300 -0.232689 -0.055745 -0.266654 0.013633 -0.078909 0.385291 0.041120 0.099138 -0.157950 0.152290 -0.010011 -0.045777 0.182141 0.095774 0.204834
polarizability: 1.76544756e+02 4.05713309e+00 1.62915000e+02 1.94049855e+01 -7.49107824e+00 9.17570942e+01
1716.lowfreq: -7.4944 -5.3537 -0.0009 -0.0007 -0.0005 4.6156 33.6687 39.5934 52.4331
frequency: 33.6583 39.5188 52.4148 60.0821 91.1301 104.9397 129.5117 150.2254 159.9576 188.0360 208.5367 243.1805 253.6874 284.3826 293.3347 312.7052 343.8283 363.4535 409.9282 440.6163 501.2337 510.5682 546.7086 567.5410 578.6203 591.2989 597.9990 613.7771 673.6854 701.0413 705.8982 722.4880 756.7639 768.8899 789.3183 811.7714 891.3692 933.4500 954.9318 968.9807 977.2122 986.9493 1041.6787 1049.9909 1089.8936 1112.5727 1114.5916 1146.3235 1148.7317 1172.7569 1192.5343 1200.4958 1220.3300 1250.1591 1265.4484 1308.7889 1317.8004 1323.3111 1372.5303 1389.9694 1412.8880 1446.2821 1449.5175 1454.3049 1464.6908 1480.1077 1584.2410 1597.4641 1630.5348 1651.5757 1655.0374 2984.1854 3011.7771 3052.7952 3081.7656 3097.6510 3126.7856 3127.9159 3156.1742 3183.6965 3432.1493 3508.4616 3527.9151 3553.7907
redmass: 6.8516 6.6569 5.6767 4.8532 6.4447 4.3623 3.2830 1.5388 5.2151 5.1656 1.2993 3.1159 4.5869 3.0877 3.2756 3.2871 4.1085 3.0611 6.7252 5.0698 3.3209 4.5688 3.3489 4.3834 1.3976 3.1440 1.6993 2.6853 4.4753 3.6922 1.8097 4.9729 2.6336 2.4970 5.7590 2.1749 4.1257 1.5791 2.2307 5.9031 2.9428 1.3871 2.5023 2.6129 1.9880 1.2721 2.0708 1.4148 1.5207 1.2855 1.9385 1.4094 2.7930 1.4827 1.8137 1.9986 1.5812 1.6652 1.4860 6.4714 1.7030 1.9465 1.2822 1.3928 1.2442 1.0645 6.7793 6.5563 7.7439 1.0983 8.1196 1.0325 1.0595 1.0860 1.1027 1.0994 1.0890 1.1054 1.0923 1.0965 1.0454 1.0640 1.0641 1.0959
irintensity: 0.2864 0.5919 0.4185 1.0066 2.9030 1.5839 7.9138 0.3004 1.3596 0.1950 46.5985 1.9761 8.5743 4.6352 5.3102 11.5995 10.8564 11.8782 5.1516 23.8978 12.1957 2.0898 9.9205 27.9574 88.0639 43.9483 174.8107 41.1569 17.8595 49.3544 222.2863 33.3825 47.9229 13.7186 5.7825 21.0294 43.1975 6.6244 10.6230 56.6594 34.5248 2.4284 128.6483 324.7974 50.7370 5.5754 8.5751 2.9302 20.6061 19.6985 47.1104 3.5418 69.1697 11.3611 13.8933 51.4977 34.5722 12.1844 4.9144 1.6282 50.5844 18.2416 22.7016 59.9901 22.8527 24.5482 18.8740 23.3119 264.3160 22.5317 244.6415 50.5964 17.0127 10.2626 8.8004 25.0087 9.9785 8.5571 12.9338 6.4862 1.0043 15.4503 45.8877 3.4334
temp: 298.150 k
press: 1.00000 atm
elementType: 8 8 8 8 8 7 6 6 6 6 6 6 6 6 6 6 6 1 1 1 1 1 1 1 1 1 1 1 1 1
symmnumber: 1
zpe: 602339.1 jmol-1
zpe.correction: 0.229419 hartree
zpe.thermalcorrener: 0.246596 hartree
zpe.thermalcorrenthalpy: 0.247540 hartree
zpe.thermalcorrgfe: 0.183682 hartree
zpe.sumelectzpe: -856.565735 hartree
zpe.sumelectthermal: -856.548558 hartree
zpe.sumelectthermalent: -856.547614 hartree
zpe.sumelectthermalfe: -856.611472 hartree
dipole: -1.5300 1.1353 0.2317
dipole: 1.9192
quadrupole: -90.9983 -97.4080 -95.2655
quadrupole: 4.8048 -1.7511 -3.3762
quadrupole: 3.5590 -2.8508 -0.7082 4.8048 -1.7511 -3.3762
hfenergy: -856.7951542 hartree
pointgroup: C01 [X(C11H13N1O5)]
dipole: 0.5769525 0.4309201 -0.2271035 debye
polarizability: 173.491725|6.1529005|158.6395754|24.9191232|-17.6846128|99.0855499 unknown
InChI: InChI=1S/C11H13NO5/c1-17-9-6(5-8(12)11(15)16)3-2-4-7(9)10(13)14/h2-4,8,13,15H,5,12H2,1H3
charge 0 multiplicity 1
30 atoms
O  0.085325 -1.349308 -0.499195
O  -1.626354 -0.296141 1.78296
O  -2.850404 -1.982223 0.745779
O  4.070146 0.226198 0.531987
O  2.548952 -1.350999 1.272171
N  -4.259513 0.10287 -0.719401
C  -1.893814 0.371157 -1.396617
C  -0.504847 0.873609 -1.049022
C  -2.901002 0.314133 -0.194191
C  0.50119 -0.01989 -0.565099
C  -0.174173 2.233811 -1.223527
C  1.793182 0.475024 -0.194027
C  1.122086 2.725054 -0.936004
C  2.09134 1.851984 -0.422299
C  -2.479866 -0.788104 0.794021
C  2.772936 -0.325746 0.576639
C  0.989999 -2.466685 -0.833491
H  -1.839969 -0.638024 -1.844375
H  -2.36941 1.049162 -2.126347
H  -2.86407 1.28297 0.333044
H  -0.940467 2.913551 -1.615509
H  1.362161 3.780278 -1.098853
H  3.086911 2.214148 -0.154135
H  -4.994992 0.327146 -0.039456
H  -4.385111 -0.849862 -1.085452
H  1.477501 -2.843121 0.078199
H  1.756415 -2.142825 -1.562682
H  0.336765 -3.231646 -1.28152
H  -1.270012 -1.04966 2.327847
H  4.651999 -0.311364 1.133753
