program: Gaussian 09
title: 000064812
version: EM64L-G09RevD.01
frameworkgroup: C1[X(C10H12O)]
method: RPBEPBE
basis: SDD
operation: Freq
keyword: #pfreq=noraman
keyword: PBEPBE/SDD
title: #p freq=noraman PBEPBE/SDD
converged: YES YES NO NO
title: Mulliken charges:
elementType: O C C C C C C C C C C H H H H H H H H H H H H
charge: -0.195878 -0.560198 0.494649 -0.447515 -0.407486 -0.407505 0.431149 -0.385347 -0.385249 -0.805900 -0.054090 0.229004 0.228407 0.246023 0.245917 0.230788 0.230730 0.227440 0.227433 0.223576 0.223574 0.235841 0.174635
chargesum: 0.00000
title: Mulliken charges with hydrogens summed into heavy atoms:
elementType: O C C C C C C C C C C
charge: -0.195878 -0.102787 0.494649 0.044425 -0.176698 -0.176775 0.431149 -0.157906 -0.157816 -0.122909 0.120545
polarizability: 1.52446258e+02 5.34411705e-03 9.89761932e+01 7.87703182e+00 3.54110880e-02 7.05599675e+01
1716.lowfreq: -5.5334 0.0002 0.0004 0.0007 5.3789 18.8044 25.2802 34.2305 38.1236
frequency: 25.2498 33.5561 37.8910 66.9739 166.5070 168.9537 194.2573 277.7619 350.8864 371.4962 405.8448 459.8892 533.4453 638.9029 645.1156 665.5299 720.9591 770.1497 811.4473 839.8513 843.9978 851.9356 896.8822 952.6982 972.1177 981.8804 1013.1293 1025.2484 1048.0018 1067.9407 1121.2883 1153.7801 1192.0466 1218.0237 1223.9688 1261.2148 1266.7277 1314.8230 1344.6988 1372.9035 1374.1618 1397.6160 1406.6533 1425.2910 1472.7122 1473.1957 1474.0110 1509.6808 1584.2371 1625.8891 1642.8415 2850.3057 2960.1256 2973.9901 2998.4815 3006.7366 3054.9791 3064.9113 3083.4165 3107.2942 3108.7705 3129.8429 3136.5692
redmass: 1.0582 2.8621 4.7534 4.3341 5.0947 1.7342 4.9934 2.4100 3.8962 2.4222 2.8463 4.3306 2.8402 6.7275 5.3748 1.1636 3.1915 3.7614 1.7273 1.2966 3.5339 1.2562 2.6712 1.3553 1.3823 1.4440 2.9331 1.5955 1.5553 2.8673 1.3528 1.2373 1.1002 3.7754 2.0976 1.1737 1.6163 1.2671 1.6496 1.2089 5.3223 1.2250 2.7907 1.0897 1.0945 1.0554 1.0941 2.7571 6.0207 6.4870 7.5926 1.0843 1.0620 1.0385 1.0963 1.0603 1.0951 1.1026 1.0998 1.0869 1.0871 1.0961 1.0973
irintensity: 1.1152 0.2669 7.4523 1.0643 11.9239 1.7590 0.9039 0.5121 1.1303 0.0886 0.0059 10.2553 22.0195 0.0616 5.4005 7.7654 0.5422 4.2792 38.1792 0.0489 7.6829 0.0017 15.7182 3.0594 0.0246 0.1309 3.4679 0.2445 18.6122 0.2168 12.9469 0.8341 0.2261 0.8593 0.1732 0.2770 36.5837 0.1642 16.8158 4.7095 0.3383 9.5871 0.9316 37.4090 14.0333 7.7275 19.6937 41.8751 0.2088 0.8010 146.1021 166.5735 29.7104 38.2038 5.6830 18.6975 23.9940 16.9709 19.4539 0.2651 29.8317 51.4147 0.5714
temp: 298.150 k
press: 1.00000 atm
elementType: 8 6 6 6 6 6 6 6 6 6 6 1 1 1 1 1 1 1 1 1 1 1 1
symmnumber: 1
zpe: 497465.2 jmol-1
zpe.correction: 0.189474 hartree
zpe.thermalcorrener: 0.200810 hartree
zpe.thermalcorrenthalpy: 0.201754 hartree
zpe.thermalcorrgfe: 0.149681 hartree
zpe.sumelectzpe: -462.665643 hartree
zpe.sumelectthermal: -462.654308 hartree
zpe.sumelectthermalent: -462.653364 hartree
zpe.sumelectthermalfe: -462.705437 hartree
dipole: 2.3101 0.0228 2.2638
dipole: 3.2345
quadrupole: -73.8899 -60.0855 -67.7886
quadrupole: -0.1114 -8.2189 -0.0191
quadrupole: -6.6353 7.1692 -0.5339 -0.1114 -8.2189 -0.0191
hfenergy: -462.8551175 hartree
pointgroup: C01 [X(C10H12O1)]
dipole: -0.9061684 -0.0118552 0.8933476 debye
dipolederiv: -0.7780686 -0.0019192 0.1381519 -0.0048014 -0.2909986 0.0047654 0.3033431 0.0047888 -0.6511978 -0.0231136 0.0001795 -0.0130034 -0.0011304 0.1336497 0.0011682 -0.1329764 0.0006736 0.0752462 0.370926 -0.0005062 -0.007631 -0.0003473 -0.07124 -0.0001627 -0.01328 -0.0000213 -0.0796855 -0.611604 0.0004947 0.0871097 0.0026757 0.15785 0.0004207 0.3036331 0.0016759 -0.0233847 -0.1297761 0.0214943 -0.0323829 0.1011849 0.0743279 -0.0080351 -0.0314795 -0.0022105 -0.1507509 -0.1301985 -0.0206855 -0.0326007 -0.1002643 0.0746038 0.0104512 -0.0325761 0.0044876 -0.1506544 0.3823015 -0.0004253 -0.0506841 -0.0005372 -0.0743095 -0.0000904 0.0235944 -0.0002078 -0.0427775 -0.1264074 -0.033363 -0.0079861 -0.1385023 0.0875785 0.0089032 -0.0156384 -0.0024247 -0.1601786 -0.1256889 0.0341657 -0.0076506 0.1392142 0.0870921 -0.0063926 -0.0141952 0.0050248 -0.1602394 -0.1516047 0.000225 0.0222063 0.0005936 0.0823409 -0.000015 -0.0807447 0.0001173 0.0816069 1.2110661 0.0005084 -0.1320749 0.0004998 0.0695005 -0.010753 -0.2092884 -0.0113352 0.8531665 0.034232 -0.0189388 0.0233468 -0.0572885 -0.0529641 0.0991238 0.0134424 0.0642065 0.0179009 0.0331583 0.0186446 0.0230264 0.0576103 -0.0523114 -0.1003262 0.0136171 -0.0652638 0.0159209 0.0822245 0.0311343 0.0167824 0.0230696 -0.0168224 -0.1171262 -0.0443386 -0.0741799 0.0264969 0.0811992 -0.0318306 0.0160154 -0.0246182 -0.0185241 0.1171058 -0.0458286 0.0741959 0.0270268 0.0205055 -0.1091105 0.0283169 -0.1032025 -0.0598883 0.0125141 0.0318511 0.0159344 0.1349904 0.0211167 0.1086431 0.0293722 0.1026269 -0.0603151 -0.0145923 0.0328071 -0.0180033 0.1346834 0.0108862 0.1045575 0.0217993 0.1032875 -0.0679106 -0.0123768 0.0302828 -0.0194695 0.1432562 0.0102584 -0.1050237 0.0207524 -0.1038635 -0.0675908 0.0101769 0.0292636 0.0172308 0.1435575 0.0312307 -0.0148961 0.0263144 -0.0951825 -0.068915 0.116666 0.0825349 0.0832211 0.0440873 0.0316375 0.0143356 0.0260596 0.0941844 -0.06746 -0.1177373 0.0830988 -0.0844648 0.0422974 -0.0736929 0.0005798 -0.0684419 0.0008354 0.111837 0.0009043 -0.1243307 0.0010121 -0.0750024 -0.1705881 0.0017364 -0.1267982 0.0039558 0.0904695 0.0054081 -0.2027915 0.0050119 -0.2463661 unknown
polarizability: 152.3981557|0.0110509|98.9760511|-8.123065|0.0722053|70.6082115 unknown
InChI: InChI=1S/C10H12O/c1-9-4-6-10(7-5-9)3-2-8-11/h4-8H,2-3H2,1H3
charge 0 multiplicity 1
23 atoms
O  4.499975 0.008042 -0.455778
C  1.597355 -0.00235 -0.572268
C  0.09058 -0.001096 -0.361229
C  2.365352 -0.009668 0.77086
C  -0.629575 1.213949 -0.233523
C  -0.633356 -1.215105 -0.245706
C  -2.747419 0.000932 0.115066
C  -2.022183 1.215006 0.001798
C  -2.025977 -1.214194 -0.010429
C  -4.251753 0.002201 0.329413
C  3.876968 -0.008558 0.633105
H  1.912608 0.883987 -1.152808
H  1.909717 -0.884302 -1.161127
H  2.084122 0.867584 1.393085
H  2.082403 -0.890424 1.38671
H  -0.095626 2.168687 -0.325172
H  -0.102366 -2.170522 -0.346917
H  -2.555106 2.16979 0.093771
H  -2.56188 -2.168193 0.071889
H  -4.582622 -0.893624 0.884254
H  -4.579961 0.894045 0.892186
H  -4.791547 0.007279 -0.637733
H  4.434393 -0.023566 1.607452
