program: Gaussian 09
title: 000064859
version: EM64L-G09RevD.01
frameworkgroup: C1[X(C16H21ClO3)]
method: RPBEPBE
basis: SDD
operation: Freq
keyword: #p
keyword: freq=noraman
keyword: PBEPBE/SDD
title: #p freq=noraman PBEPBE/SDD
converged: YES YES NO NO
title: Mulliken charges:
elementType: Cl O O O C C C C C C C C C C C C C C C C H H H H H H H H H H H H H H H H H H H H H
charge: -0.075353 -0.457250 -0.463672 -0.211187 -0.204728 -0.440062 -0.437664 -0.401679 -0.400548 -0.384047 0.681113 -0.450676 -0.396608 0.149263 0.395200 -0.389754 -0.453141 -0.562656 -0.700999 0.216284 0.231188 0.218143 0.190369 0.197641 0.219758 0.197378 0.200713 0.201243 0.197994 0.187594 0.201209 0.233329 0.269607 0.281327 0.269738 0.239411 0.215718 0.226857 0.245808 0.369218 0.393923
chargesum: 0.00000
title: Mulliken charges with hydrogens summed into heavy atoms:
elementType: Cl O O O C C C C C C C C C C C C C C C C
charge: -0.075353 -0.088032 -0.069750 -0.211187 0.026460 -0.031550 -0.020265 -0.003589 -0.001311 0.004755 0.681113 -0.450676 -0.163278 0.149263 0.395200 -0.120147 -0.171814 -0.053507 -0.012615 0.216284
polarizability: 2.35127707e+02 7.85423770e+00 1.81701315e+02 8.40000545e+00 -9.25721396e+00 1.49672650e+02
1716.lowfreq: -5.8924 -0.0020 -0.0012 -0.0010 3.0273 8.4464 19.2880 28.3376 38.1898
frequency: 18.5261 27.1622 38.1379 53.2553 67.8069 73.7115 137.6713 149.5734 168.3955 178.2471 185.5918 208.1623 213.4113 226.4951 267.0876 286.6248 310.7866 332.6152 346.7931 378.8808 398.1762 401.9045 430.1030 446.3570 456.9465 483.3248 485.1467 499.3429 530.9112 554.0505 571.6717 610.7358 630.6349 653.1838 683.6165 732.5219 744.3455 783.7375 786.2404 813.6796 829.5829 850.0465 853.5890 866.2407 883.4922 894.4450 894.9754 920.8901 925.3127 946.0977 982.7175 989.1710 1023.3868 1034.1241 1048.4816 1053.3577 1070.5461 1072.1442 1105.2778 1111.6073 1117.8163 1143.2397 1155.6449 1180.8388 1183.3178 1210.5850 1232.0340 1249.7712 1259.0623 1261.7672 1275.9752 1283.6657 1288.9020 1300.6629 1307.8933 1329.5540 1335.6704 1341.7820 1344.2080 1350.7070 1370.8646 1373.1577 1384.5179 1387.0590 1435.0948 1456.2555 1460.2429 1463.7991 1465.9456 1470.2159 1472.8293 1478.9055 1483.9797 1554.5901 1613.3083 1682.1138 2965.0188 2966.0453 2968.2220 2969.0991 2969.8402 2994.5361 3000.4222 3014.0933 3026.3518 3027.9516 3034.1664 3035.8128 3046.5307 3093.9200 3098.7967 3106.4381 3130.8419 3157.7575 3164.4083 3458.9751 3521.2967
redmass: 5.9146 4.4461 4.2747 10.4394 5.5375 4.1435 4.2703 4.8398 4.4365 4.1649 3.5368 2.6799 1.2556 1.7967 3.4472 5.4174 3.7112 2.4756 5.8145 3.1837 2.9837 4.4445 3.1229 3.7785 3.5809 3.6662 2.0380 1.7251 3.1510 1.3645 2.4618 1.6420 2.9972 4.0280 4.9133 3.4210 3.7046 2.5783 1.6222 4.7486 3.5911 1.7698 1.8858 1.8986 1.4808 1.5649 2.2896 1.9114 1.9274 1.9021 1.3572 2.4818 3.2465 2.5308 1.8170 1.4534 1.8469 1.2336 2.2406 2.4504 2.0095 2.1570 1.5666 1.4804 1.6662 1.8933 1.5217 2.2283 1.2788 1.3519 1.5483 1.9093 1.3589 1.3467 1.2911 1.3035 1.3646 1.4815 1.5873 1.6201 1.5995 1.9917 1.2884 4.0463 1.0844 1.0683 1.0893 1.0881 1.1013 1.1332 1.0826 1.1647 2.0023 7.1041 7.2257 8.8815 1.0627 1.0614 1.0610 1.0629 1.0650 1.0350 1.0819 1.0633 1.0972 1.0952 1.1003 1.1029 1.1026 1.0988 1.0997 1.1000 1.0879 1.0912 1.0946 1.0649 1.0642
irintensity: 0.1620 0.1488 0.1016 1.5060 1.3568 0.0338 1.1427 0.5316 0.6692 0.7120 0.4956 0.0676 0.0598 0.0723 0.1974 3.6430 0.5606 0.5998 8.6824 3.5169 4.2107 3.1618 0.2112 4.3062 3.9849 4.1736 19.8837 17.0128 12.7432 48.5252 12.4323 234.1026 77.9984 37.9125 5.7616 17.7150 3.8762 15.3864 3.8789 21.3548 6.1450 12.3970 23.5128 2.4177 14.8984 4.8954 0.7080 0.5658 25.8139 10.5229 0.1636 22.9188 19.7450 23.8490 0.5866 0.3081 82.6537 7.9358 70.4900 0.3696 20.8051 48.3075 37.6078 2.5823 18.6142 1.6689 4.5262 85.3450 2.2337 1.7279 13.5765 35.4952 4.0132 10.3328 1.6781 0.2409 0.2294 0.4231 2.3306 5.0816 78.8792 0.6298 30.4437 11.7288 19.9746 9.8375 2.3539 9.7012 4.3513 6.5619 15.1168 9.9260 34.0699 10.7730 2.0600 207.7822 25.6055 36.4059 35.1901 49.7855 1.4785 18.7132 18.7323 7.2739 86.7506 74.6313 3.9055 3.4056 113.5125 4.4213 36.0127 15.7379 13.9223 4.1343 2.9483 74.7335 26.6346
temp: 298.150 k
press: 1.00000 atm
elementType: 17 8 8 8 6 6 6 6 6 6 6 6 6 6 6 6 6 6 6 6 1 1 1 1 1 1 1 1 1 1 1 1 1 1 1 1 1 1 1 1 1
symmnumber: 1
zpe: 886298.6 jmol-1
zpe.correction: 0.337573 hartree
zpe.thermalcorrener: 0.357481 hartree
zpe.thermalcorrenthalpy: 0.358425 hartree
zpe.thermalcorrgfe: 0.287613 hartree
zpe.sumelectzpe: -1306.536145 hartree
zpe.sumelectthermal: -1306.516237 hartree
zpe.sumelectthermalent: -1306.515293 hartree
zpe.sumelectthermalfe: -1306.586105 hartree
dipole: 0.3544 -1.5175 1.2062
dipole: 1.9706
quadrupole: -118.0481 -139.3674 -118.7131
quadrupole: -2.3494 1.6223 0.8612
quadrupole: 7.3281 -13.9912 6.6631 -2.3494 1.6223 0.8612
hfenergy: -1306.8737181 hartree
pointgroup: C01 [X(C16H21Cl1O3)]
dipole: 0.1042448 0.2239792 0.7348835 debye
polarizability: 234.6333633|13.5112307|148.4270938|-2.075662|-3.8973617|183.4412153 unknown
InChI: InChI=1S/C16H21ClO3/c1-16(20,10-15(18)19)12-7-8-13(14(17)9-12)11-5-3-2-4-6-11/h7-9,11,18,20H,2-6,10H2,1H3
charge 0 multiplicity 1
41 atoms
Cl 1.017704 -0.368656 -2.948092
O  -3.578082 -0.335088 1.677971
O  -3.717743 1.946719 0.123597
O  -3.642827 1.703454 -2.183295
C  2.726083 0.001248 -0.255425
C  3.57349 -1.017156 0.560231
C  3.084968 1.459426 0.162842
C  5.087441 -0.739448 0.401897
C  4.599361 1.734015 0.011257
C  5.44235 0.710742 0.808753
C  1.226878 -0.245771 -0.12959
C  0.355996 -0.40743 -1.232318
C  0.603854 -0.287183 1.149464
C  -3.131418 -0.889031 0.38693
C  -1.624499 -0.628115 0.180261
C  -1.034802 -0.596462 -1.10602
C  -0.781724 -0.474488 1.309362
C  -4.011787 -0.291088 -0.760369
C  -3.398923 -2.405453 0.498172
C  -3.769115 1.174281 -1.063072
H  3.008208 -0.113231 -1.320209
H  3.333141 -2.046871 0.232784
H  3.305138 -0.951724 1.634705
H  2.784149 1.618254 1.21915
H  2.49992 2.173769 -0.447617
H  5.379755 -0.902101 -0.656206
H  5.667448 -1.461875 1.00841
H  4.829818 2.764895 0.343574
H  4.874068 1.67458 -1.062256
H  5.247889 0.843497 1.8936
H  6.522123 0.898573 0.65124
H  1.232345 -0.166788 2.039508
H  -1.634389 -0.711205 -2.013778
H  -1.232897 -0.496999 2.306016
H  -5.065036 -0.409568 -0.441691
H  -3.882545 -0.844896 -1.703966
H  -3.05675 -2.937469 -0.406325
H  -4.476613 -2.591841 0.6494
H  -2.852928 -2.806708 1.368007
H  -3.581324 0.658114 1.58732
H  -3.536724 2.898379 -0.10352
