program: Gaussian 09
title: 000064820
version: EM64L-G09RevD.01
frameworkgroup: C1[X(C13H20O2)]
method: RPBEPBE
basis: SDD
operation: Freq
keyword: #pfreq=noraman
keyword: PBEPBE/SDD
title: #p freq=noraman PBEPBE/SDD
converged: YES YES NO NO
title: Mulliken charges:
elementType: O O C C C C C C C C C C C C C H H H H H H H H H H H H H H H H H H H H
charge: -0.280575 -0.276306 -0.457570 0.059127 -0.553081 0.498892 -0.409807 -0.415139 -0.220121 -0.201143 -0.229403 -0.228832 -0.673187 -0.682861 -0.246203 0.214381 0.230232 0.178404 0.237714 0.223576 0.235145 0.231035 0.193559 0.185633 0.224851 0.176999 0.221228 0.220606 0.203534 0.225338 0.230353 0.203043 0.224292 0.231477 0.224810
chargesum: 0.00000
title: Mulliken charges with hydrogens summed into heavy atoms:
elementType: O O C C C C C C C C C C C C C
charge: -0.280575 -0.276306 -0.012957 0.237531 -0.091790 0.498892 -0.174662 -0.184104 0.159071 0.200707 -0.008175 -0.008226 -0.013962 -0.024049 -0.021394
polarizability: 1.84347039e+02 -2.07759960e+00 1.57230934e+02 -6.56435638e+00 -5.13500887e+00 9.74305230e+01
1716.lowfreq: -13.0306 -0.0003 0.0006 0.0007 3.5209 6.5544 22.2488 26.1113 33.1317
frequency: 21.5949 25.9846 33.0264 42.4848 49.8304 66.3524 75.1132 109.5900 159.6402 204.1780 207.8608 241.8089 247.2720 272.5106 311.1848 328.0030 347.5843 404.0943 452.6372 495.5173 516.4626 555.0205 617.9017 654.6476 706.2758 752.9870 764.6655 807.3361 812.5429 816.1095 832.3636 854.4748 863.7420 905.7309 918.7456 939.8126 975.0981 989.6149 991.1871 1012.3122 1026.3721 1033.5263 1042.5961 1060.8515 1086.2939 1100.9812 1116.7369 1123.5253 1137.0876 1138.6845 1169.5711 1172.6352 1185.2440 1218.6446 1243.9043 1252.7772 1269.7250 1279.3328 1314.7139 1319.1595 1325.9890 1349.9009 1370.4267 1381.0207 1382.5923 1393.6532 1397.6883 1439.3843 1453.9953 1459.4385 1459.8865 1477.8768 1480.8750 1483.2535 1487.9235 1492.7308 1494.0078 1591.7019 1613.9705 2852.1443 2920.6228 2933.5015 2970.4527 2992.3765 2992.6988 2993.6280 3010.9291 3030.6216 3043.1122 3076.4240 3089.9333 3091.3365 3100.3381 3100.6209 3111.4802 3113.2269 3128.8400 3140.1572 3159.4185
redmass: 3.5496 3.8682 1.8332 2.2366 3.3419 2.6185 3.1551 3.4682 3.1928 2.3658 3.1110 1.2959 1.3824 3.5563 2.4559 3.4536 2.8179 2.8261 2.9585 3.5135 4.5933 4.1240 6.3607 4.4852 1.7333 2.0156 1.5600 1.6603 1.1888 1.4681 1.9273 1.2580 3.0258 2.0223 2.0894 2.4453 1.3868 5.8621 1.3309 2.1217 2.1877 2.9982 3.2989 3.0082 1.7469 2.2610 2.0238 2.2540 1.4266 1.5036 1.1124 1.2546 1.1141 2.3442 1.1590 1.1490 1.5479 1.1679 1.2966 1.2031 1.2503 1.4829 1.3402 4.6786 1.4074 1.2769 1.3233 2.1869 1.0857 1.0410 1.0414 1.0485 1.0478 2.2925 1.1122 1.0803 1.0822 6.0573 6.1950 1.0825 1.0564 1.0653 1.1047 1.0494 1.0463 1.0360 1.0599 1.0962 1.0997 1.1036 1.0988 1.0991 1.1012 1.1010 1.0862 1.0871 1.0909 1.0959 1.1015
irintensity: 0.0694 0.2466 1.8315 0.3259 0.2953 1.4508 1.1262 2.1521 7.6432 0.5070 1.4341 1.5802 1.4717 4.2390 2.5823 4.4876 0.8122 0.0042 2.1258 13.6559 3.8074 6.0631 0.0871 0.0735 51.2018 39.1320 11.5507 22.0804 1.8572 1.3478 21.7619 0.2376 5.5770 13.9759 63.6120 58.7072 0.1382 0.0115 0.3214 53.3320 8.8428 37.5727 113.7258 62.3126 5.9793 33.3320 5.5324 50.2448 3.6721 8.9829 7.3898 31.3782 0.1792 1.8229 3.3105 2.7038 67.9401 3.1252 43.3135 35.7651 2.7952 2.9126 6.3894 0.1974 11.7384 16.1153 16.9092 7.2683 5.8177 12.1095 10.7202 4.7189 6.7584 25.3485 10.8017 4.9207 3.8746 1.1094 13.5073 77.2198 62.6480 81.0777 62.4395 39.5993 14.2564 22.1910 23.2578 22.3234 10.9866 21.1625 37.9397 35.6326 40.8738 38.5851 10.2448 6.0535 12.1269 50.1444 26.5964
temp: 298.150 k
press: 1.00000 atm
elementType: 8 8 6 6 6 6 6 6 6 6 6 6 6 6 6 1 1 1 1 1 1 1 1 1 1 1 1 1 1 1 1 1 1 1 1
symmnumber: 1
zpe: 789917.2 jmol-1
zpe.correction: 0.300864 hartree
zpe.thermalcorrener: 0.317687 hartree
zpe.thermalcorrenthalpy: 0.318632 hartree
zpe.thermalcorrgfe: 0.252690 hartree
zpe.sumelectzpe: -656.636381 hartree
zpe.sumelectthermal: -656.619558 hartree
zpe.sumelectthermalent: -656.618613 hartree
zpe.sumelectthermalfe: -656.684555 hartree
dipole: 1.8214 1.1493 1.7396
dipole: 2.7685
quadrupole: -82.1431 -83.6938 -94.1365
quadrupole: 0.4335 1.9243 0.1478
quadrupole: 4.5147 2.9640 -7.4787 0.4335 1.9243 0.1478
hfenergy: -656.9372449 hartree
pointgroup: C01 [X(C13H20O2)]
dipole: 0.6832417 -0.507705 -0.6795572 debye
polarizability: 184.3521169|-0.2302896|157.1378767|7.094935|-5.3385115|97.5185027 unknown
InChI: InChI=1S/C13H20O2/c1-3-14-13(15-4-2)11-10-12-8-6-5-7-9-12/h5-9,13H,3-4,10-11H2,1-2H3
charge 0 multiplicity 1
35 atoms
O  2.198046 -1.201809 0.206746
O  2.282857 1.13944 -0.079667
C  0.294002 0.02945 -0.84489
C  1.815646 -0.079164 -0.67977
C  -0.445567 0.263357 0.49998
C  -1.952365 0.324991 0.307663
C  -2.594979 1.550526 -0.009798
C  -2.749943 -0.845526 0.402667
C  2.348784 -2.485986 -0.496221
C  3.755315 1.228081 0.030377
C  -3.990041 1.606375 -0.228667
C  -4.145757 -0.796373 0.184878
C  2.891793 -3.499148 0.512198
C  4.081298 2.592472 0.634532
C  -4.771799 0.431267 -0.133526
H  -0.077269 -0.900033 -1.319153
H  0.076194 0.858766 -1.544629
H  2.31587 -0.245245 -1.669212
H  -0.066602 1.202727 0.940072
H  -0.169752 -0.554202 1.191124
H  -1.995064 2.467081 -0.077668
H  -2.271896 -1.800044 0.658242
H  1.368729 -2.822437 -0.899233
H  3.046784 -2.365039 -1.355486
H  4.11934 0.399344 0.666228
H  4.201967 1.118012 -0.983476
H  -4.46777 2.563723 -0.467675
H  -4.744699 -1.710847 0.268491
H  3.017011 -4.489357 0.037073
H  3.869707 -3.169538 0.903596
H  2.198128 -3.603444 1.364193
H  5.175088 2.71576 0.737088
H  3.69402 3.406035 -0.003004
H  3.623751 2.688568 1.634277
H  -5.854328 0.472716 -0.299552
