program: Gaussian 09
title: 000064802
version: EM64L-G09RevD.01
frameworkgroup: C1[X(C15H14O)]
method: RPBEPBE
basis: SDD
operation: Freq
keyword: #pfreq=noraman
keyword: PBEPBE/SDD
title: #p freq=noraman PBEPBE/SDD
converged: YES YES NO NO
title: Mulliken charges:
elementType: O C C C C C C C C C C C C C C C H H H H H H H H H H H H H H
charge: -0.221948 -0.567141 -0.524193 0.492106 0.129063 0.282472 -0.416616 -0.415541 -0.341519 -0.345233 -0.229107 -0.229426 -0.243874 -0.245652 -0.228834 -0.223313 0.231594 0.231824 0.249477 0.249390 0.233626 0.233498 0.247999 0.277826 0.223808 0.223810 0.227211 0.231187 0.233734 0.233770
chargesum: 0.00000
title: Mulliken charges with hydrogens summed into heavy atoms:
elementType: O C C C C C C C C C C C C C C C
charge: -0.221948 -0.103723 -0.025325 0.492106 0.129063 0.282472 -0.182990 -0.182042 -0.093520 -0.067407 -0.005298 -0.005617 -0.016663 -0.014465 0.004901 0.010457
polarizability: 2.19901740e+02 1.08784373e+01 1.43321831e+02 3.97369245e-01 -1.24388760e-01 1.12733558e+02
1716.lowfreq: -16.2690 -0.0003 -0.0002 0.0004 2.7553 6.0387 7.2336 28.9957 46.2395
frequency: -12.1532 28.8628 46.2334 46.7835 94.6598 140.6025 159.2878 204.9144 260.5280 326.1422 350.4458 400.3956 402.9111 417.6197 452.5593 517.1586 552.8043 570.6704 613.0584 617.9253 649.6337 697.1346 705.0455 753.5124 754.4956 763.8024 801.1957 842.8336 853.1761 860.0916 917.3308 942.0265 971.6189 974.9147 989.6275 989.8943 991.4941 992.4664 992.9525 1012.1365 1025.1945 1027.0744 1066.2279 1080.6837 1086.2393 1139.6933 1171.3092 1173.0677 1185.8741 1188.8497 1209.5004 1217.6651 1271.0640 1288.5823 1316.8607 1326.5089 1348.7606 1381.7407 1387.4622 1432.7604 1437.0018 1439.6141 1469.8386 1479.1748 1484.0052 1569.9533 1592.5721 1598.5258 1612.3340 1614.7842 2969.9908 3011.7720 3016.8377 3071.3656 3113.0301 3113.2619 3128.5145 3130.3197 3138.1957 3141.8705 3149.6925 3158.6314 3161.1056 3169.1662
redmass: 3.9336 3.7848 4.6365 4.9203 2.6302 4.9180 3.7374 6.2500 4.8507 2.3515 5.2626 2.8064 2.8211 3.1855 5.3984 3.7781 4.7006 2.2177 6.4334 6.3294 6.4223 1.8349 1.7749 1.4828 2.4497 3.3488 1.6012 3.4294 1.2486 1.2482 1.5291 1.3957 4.8206 1.3898 5.6549 6.0615 1.7766 1.4426 1.3588 1.3631 2.2266 2.1215 2.9771 1.5711 1.6566 1.1597 1.0514 1.0706 1.1130 1.1240 2.1521 2.2910 1.1820 1.9806 1.3492 1.2522 1.6742 7.8779 9.3063 1.2508 1.7989 2.1842 1.1141 2.1714 2.3154 6.8596 6.0606 6.7806 6.4237 6.2622 1.0602 1.0604 1.0977 1.1028 1.0876 1.0866 1.0850 1.0906 1.0880 1.0958 1.0923 1.0960 1.1014 1.1013
irintensity: 0.1836 0.1978 1.1197 0.6789 3.2442 0.2083 0.3990 3.2801 10.1838 0.3132 0.3558 0.0425 0.0044 1.2432 0.1143 29.8246 6.6649 5.9581 0.2750 0.0501 8.7095 47.0595 52.8647 60.0589 34.3392 9.9674 5.6639 1.3896 0.0096 0.4774 1.1390 2.7656 60.7388 0.0341 0.4874 3.4577 1.2575 0.1076 1.4542 0.0945 4.5724 4.8348 0.1425 8.9109 8.9111 1.0501 0.1007 4.3270 1.4626 23.2445 72.5454 0.1379 0.1630 148.5663 2.4767 0.1872 45.6641 0.2067 2.5762 8.5140 28.2329 6.8926 14.0732 0.3637 21.2294 92.3924 1.3114 41.6443 20.1891 8.2402 23.0588 15.4391 4.3011 15.9921 7.5940 10.7941 0.2487 9.8665 5.8810 45.9210 16.5676 23.2378 25.2506 22.1154
temp: 298.150 k
press: 1.00000 atm
elementType: 8 6 6 6 6 6 6 6 6 6 6 6 6 6 6 6 1 1 1 1 1 1 1 1 1 1 1 1 1 1
symmnumber: 1
zpe: 638540.4 jmol-1
zpe.correction: 0.243207 hartree
zpe.thermalcorrener: 0.256166 hartree
zpe.thermalcorrenthalpy: 0.257110 hartree
zpe.thermalcorrgfe: 0.201752 hartree
zpe.sumelectzpe: -654.097461 hartree
zpe.sumelectthermal: -654.084503 hartree
zpe.sumelectthermalent: -654.083559 hartree
zpe.sumelectthermalfe: -654.138917 hartree
dipole: 0.9819 -3.1892 -0.0171
dipole: 3.3370
quadrupole: -80.2157 -97.9828 -91.2237
quadrupole: -1.4740 0.0681 -0.0826
quadrupole: 9.5917 -8.1754 -1.4163 -1.4740 0.0681 -0.0826
hfenergy: -654.3406687 hartree
pointgroup: C01 [X(C15H14O1)]
dipole: -0.3885442 -1.253943 0.0178175 debye
polarizability: 219.8625015|-11.0116556|143.3608586|0.4952803|-0.1471622|112.7337678 unknown
InChI: InChI=1S/C15H14O/c16-15(14-9-5-2-6-10-14)12-11-13-7-3-1-4-8-13/h1-10H,11-12H2
charge 0 multiplicity 1
30 atoms
O  -1.271723 2.278973 -0.029474
C  1.340258 1.243919 -0.017259
C  0.127061 0.283475 0.001061
C  2.656062 0.48006 -0.00784
C  -1.219818 1.013275 -0.011069
C  -2.484396 0.196735 -0.0011
C  3.283672 0.126287 1.214964
C  3.268983 0.072708 -1.22142
C  -2.4762 -1.224619 0.02143
C  -3.730863 0.880987 -0.015022
C  4.487307 -0.614515 1.227056
C  4.472488 -0.668278 -1.215709
C  5.085952 -1.01631 0.010259
C  -3.689936 -1.944735 0.029753
C  -4.941796 0.161811 -0.006851
C  -4.924446 -1.254307 0.015592
H  1.266301 1.888963 -0.911366
H  1.27041 1.918489 0.855052
H  0.175097 -0.37059 0.895722
H  0.173824 -0.402686 -0.869193
H  2.830363 0.443438 2.162926
H  2.804088 0.348117 -2.1768
H  -1.528183 -1.772679 0.032585
H  -3.71582 1.975968 -0.032196
H  4.960297 -0.87255 2.181615
H  4.933885 -0.96813 -2.163692
H  6.021172 -1.587433 0.0172
H  -3.675716 -3.039971 0.047112
H  -5.897245 0.697591 -0.017889
H  -5.865876 -1.815093 0.021951
