program: Gaussian 09
title: 000064814
version: EM64L-G09RevD.01
frameworkgroup: C1[X(C11H15NO2)]
method: RPBEPBE
basis: SDD
operation: Freq
keyword: #p
keyword: freq=noraman
keyword: PBEPBE/SDD
title: #p freq=noraman PBEPBE/SDD
converged: YES YES NO NO
title: Mulliken charges:
elementType: O O N C C C C C C C C C C C H H H H H H H H H H H H H H H
charge: -0.504458 -0.272086 -0.608226 0.128808 -0.400773 -0.521311 0.393928 -0.688486 -0.389843 -0.385834 0.196024 -0.242675 -0.229316 -0.240553 0.221829 0.191504 0.227120 0.229327 0.216262 0.212435 0.243877 0.232461 0.275561 0.348541 0.227357 0.224863 0.228415 0.323635 0.361614
chargesum: 0.00000
title: Mulliken charges with hydrogens summed into heavy atoms:
elementType: O O N C C C C C C C C C C C
charge: -0.155917 -0.272086 0.077023 0.128808 0.012559 -0.064864 0.393928 -0.015911 -0.157382 -0.110272 0.196024 -0.015317 -0.004453 -0.012138
polarizability: 1.30299947e+02 1.61488291e+01 1.23259074e+02 -9.43736565e+00 9.07132721e+00 1.21045805e+02
1716.lowfreq: -10.1941 -0.0003 0.0007 0.0009 7.4028 17.8198 33.9254 52.3022 71.3981
frequency: 33.6646 52.1950 71.3795 88.8905 141.4530 146.9820 217.9777 230.1759 239.4863 307.1909 316.4525 332.3451 335.3408 363.8960 402.9878 427.3834 482.8085 498.0101 544.0338 549.9682 617.6503 624.2643 658.4288 707.0027 720.5096 753.5311 766.8785 784.9477 842.1233 849.0165 858.1443 922.8671 948.4254 960.7930 983.0876 990.7215 1000.3431 1021.4756 1031.7761 1062.7432 1079.2321 1092.4657 1109.2042 1126.5610 1162.9156 1173.4242 1181.4586 1195.4450 1246.5960 1293.7542 1319.3537 1327.5274 1350.6736 1365.0280 1380.7029 1393.6062 1434.9558 1443.2217 1461.5522 1472.5190 1485.6077 1488.1697 1580.1103 1592.2546 1614.7050 1639.0206 2954.0744 2981.5548 2990.4639 3028.1424 3079.9533 3083.3861 3094.8128 3124.5961 3132.5988 3145.7967 3161.4013 3175.9980 3420.9466 3562.0075 3630.0813
redmass: 3.8417 7.5450 4.9307 2.6653 3.0228 2.2893 2.2711 1.7764 3.1504 3.7368 1.9584 2.9656 2.0410 2.9140 2.8600 3.8335 2.1237 2.8983 2.5109 2.8754 6.3869 1.9259 2.6524 1.8527 3.3260 1.2600 1.4201 1.6686 2.4516 4.0465 1.2690 1.4895 1.9366 2.1460 1.4010 5.6754 1.3195 3.1689 2.1608 2.1883 1.5797 1.5636 2.3840 2.0530 1.8145 1.0680 1.2461 1.1187 1.3164 1.5323 1.3478 1.4454 2.6709 2.0842 7.7250 1.2175 2.2097 1.0927 1.0904 1.0422 2.0855 1.0984 1.2918 6.0814 6.0761 5.5171 1.0653 1.0678 1.0362 1.0950 1.0928 1.0991 1.1000 1.0846 1.0882 1.0938 1.0983 1.0963 1.0523 1.0657 1.0984
irintensity: 0.2560 3.3385 4.7270 0.7370 1.2328 2.1792 0.5775 1.2033 21.6072 2.4859 25.0927 26.3758 60.4767 4.5980 0.0436 5.5187 9.8573 0.0397 12.2456 17.5151 0.2505 146.7909 65.2132 55.8643 25.1620 111.9811 16.7620 19.0570 33.4063 1.4272 1.9797 9.1373 7.1487 55.9769 1.2548 0.1469 0.7380 12.1117 2.1277 3.2467 20.1267 8.3185 5.6872 14.9718 40.0005 2.4117 17.6628 1.9471 2.2378 13.0257 1.8509 1.9460 42.4525 65.9417 3.2076 18.4799 13.8224 8.0335 10.8854 10.1253 10.5568 16.4175 129.7035 1.2589 4.1070 288.9563 41.2143 31.0787 28.2403 14.4113 5.4635 33.8263 37.3734 1.5982 5.7723 33.1671 23.3936 6.9989 98.5920 5.0188 66.5286
temp: 298.150 k
press: 1.00000 atm
elementType: 8 8 7 6 6 6 6 6 6 6 6 6 6 6 1 1 1 1 1 1 1 1 1 1 1 1 1 1 1
symmnumber: 1
zpe: 630810.2 jmol-1
zpe.correction: 0.240263 hartree
zpe.thermalcorrener: 0.254299 hartree
zpe.thermalcorrenthalpy: 0.255243 hartree
zpe.thermalcorrgfe: 0.199265 hartree
zpe.sumelectzpe: -632.329269 hartree
zpe.sumelectthermal: -632.315233 hartree
zpe.sumelectthermalent: -632.314289 hartree
zpe.sumelectthermalfe: -632.370267 hartree
dipole: -1.2931 3.8815 1.4327
dipole: 4.3348
quadrupole: -86.8951 -84.5537 -78.2697
quadrupole: 14.5660 5.8765 -4.3875
quadrupole: -3.6556 -1.3142 4.9698 14.5660 5.8765 -4.3875
hfenergy: -632.569532 hartree
pointgroup: C01 [X(C11H15N1O2)]
dipole: 0.2290272 1.411066 -0.9300443 debye
polarizability: 128.4887475|-18.876157|118.3656513|-6.8316314|-4.5452835|127.750427 unknown
InChI: InChI=1S/C11H15NO2/c1-2-11(14,8-10(12)13)9-6-4-3-5-7-9/h3-7,14H,2,8,12H2,1H3
charge 0 multiplicity 1
29 atoms
O  -1.473339 1.045503 -1.067617
O  -2.434832 -1.969258 1.966124
N  -2.448224 -1.486626 -0.313259
C  -0.822165 0.948278 0.278398
C  -0.465046 2.384637 0.773065
C  -1.833928 0.303783 1.273675
C  0.442605 0.100894 0.083111
C  0.457669 3.182398 -0.17006
C  1.106919 -0.452567 1.207517
C  0.996659 -0.099315 -1.205164
C  -2.249936 -1.15638 1.010407
C  2.299356 -1.191434 1.046056
C  2.188076 -0.842058 -1.367087
C  2.845984 -1.390007 -0.242701
H  0.012003 2.292567 1.7678
H  -1.414183 2.940795 0.934414
H  -2.751687 0.927588 1.288677
H  -1.430081 0.324551 2.299535
H  0.61319 4.204763 0.219018
H  0.024657 3.262573 -1.183283
H  1.444087 2.697484 -0.266161
H  0.69486 -0.326015 2.21494
H  0.483689 0.325128 -2.072206
H  -2.155676 1.762899 -1.028315
H  2.79546 -1.618102 1.924882
H  2.601688 -0.991472 -2.371033
H  3.7691 -1.966999 -0.367585
H  -2.701317 -2.447017 -0.543259
H  -2.227189 -0.79839 -1.041988
