program: Gaussian 09
title: 000064792
version: EM64L-G09RevD.01
frameworkgroup: C1[X(C12H7NO5S)]
method: RPBEPBE
basis: SDD
operation: Freq
keyword: #p
keyword: freq=noraman
keyword: PBEPBE/SDD
title: #p freq=noraman PBEPBE/SDD
converged: YES YES NO NO
title: Mulliken charges:
elementType: S O O O O O N C C C C C C C C C C C C H H H H H H H
charge: 0.892736 -0.483471 -0.458456 -0.173281 -0.162200 -0.195116 -0.490844 -0.123906 0.273449 0.264621 -0.240016 0.201982 -0.312339 0.193609 -0.205406 -0.204994 -0.317890 -0.248611 -0.160029 0.276381 0.287129 0.253146 0.249998 0.283632 0.329476 0.270399
chargesum: 0.00000
title: Mulliken charges with hydrogens summed into heavy atoms:
elementType: S O O O O O N C C C C C C C C C C C C
charge: 0.892736 -0.483471 -0.458456 -0.173281 -0.162200 -0.195116 -0.490844 -0.123906 0.273449 0.264621 0.036364 0.201982 -0.025209 0.193609 0.047740 0.045004 -0.034257 0.080865 0.110369
polarizability: 2.59582596e+02 -3.43593904e+00 1.77431829e+02 8.28074178e+00 3.29725378e+00 1.03119367e+02
1716.lowfreq: -6.6797 -4.3695 0.0012 0.0016 0.0017 4.7285 24.2401 44.0544 53.6899
frequency: 24.2202 44.0342 53.6856 88.7861 103.2402 123.6383 139.2501 156.6227 188.9222 191.5684 237.4253 248.6014 253.3496 296.8205 304.3981 353.9931 401.9155 418.9426 427.2438 475.2438 494.7216 537.2360 585.7807 595.5609 610.6656 653.9190 659.8652 719.3407 738.6291 740.6573 749.3542 783.7947 797.2933 827.8036 848.5073 855.8196 886.1789 890.6815 907.4648 954.5831 966.3461 972.6111 992.4443 1008.7457 1012.1545 1033.4114 1065.5234 1113.1120 1129.6046 1155.4529 1176.6250 1227.3800 1235.6914 1270.1510 1279.7181 1377.8570 1395.6546 1431.1404 1450.5429 1483.9858 1538.2870 1574.9641 1592.1276 1611.5704 1629.8190 3150.1201 3160.9717 3171.2654 3181.7547 3239.0256 3251.4881 3280.1729
redmass: 9.0148 4.7321 8.0314 6.6522 11.9362 6.6277 7.1650 9.6094 7.1342 9.0222 9.5193 8.8443 8.0891 8.1370 7.9514 11.3170 18.4641 3.4071 14.7340 8.0304 4.4755 8.0654 3.5806 4.5732 6.2774 5.2474 6.3712 3.8341 2.9559 1.5416 3.8370 1.5711 1.9551 6.8552 6.4077 8.2394 1.4351 1.3718 7.6747 16.1073 2.9149 1.3897 6.3511 3.9336 1.3657 2.5436 1.9269 1.6393 2.3266 3.6079 1.1458 2.8973 1.2378 1.7039 2.2432 5.9353 9.2402 2.2423 2.4637 4.6819 6.2932 6.8130 9.8805 8.0296 12.0213 1.0870 1.0907 1.0958 1.1008 1.0934 1.1006 1.1094
irintensity: 4.4549 1.6527 1.2868 0.4493 1.2883 0.3792 1.0115 2.0626 0.3303 6.3307 2.0329 5.8452 2.4560 7.2544 10.4002 20.2165 70.7922 4.0161 14.2999 3.1649 12.0461 9.8874 17.3897 1.3665 22.3392 8.2460 12.8785 43.7841 7.3870 42.9256 56.3961 39.4073 37.9199 72.2613 32.2434 24.7945 6.9673 1.5596 55.0896 77.9492 11.3436 1.0093 9.7960 1.2250 0.4303 26.1606 20.3430 49.0116 129.8925 189.6525 37.3789 353.8735 3.4597 114.8399 196.8661 20.3754 4.5293 16.2790 11.3725 45.5395 13.5157 29.4447 65.4478 28.9012 288.2822 2.7270 1.1844 0.5221 13.9592 3.8920 15.8017 0.1363
temp: 298.150 k
press: 1.00000 atm
elementType: 16 8 8 8 8 8 7 6 6 6 6 6 6 6 6 6 6 6 6 1 1 1 1 1 1 1
symmnumber: 1
zpe: 439803.9 jmol-1
zpe.correction: 0.167512 hartree
zpe.thermalcorrener: 0.183909 hartree
zpe.thermalcorrenthalpy: 0.184853 hartree
zpe.thermalcorrgfe: 0.122182 hartree
zpe.sumelectzpe: -1288.882895 hartree
zpe.sumelectthermal: -1288.866499 hartree
zpe.sumelectthermalent: -1288.865554 hartree
zpe.sumelectthermalfe: -1288.928225 hartree
dipole: -4.6335 -1.9806 -0.6938
dipole: 5.0866
quadrupole: -72.2158 -131.5385 -123.1068
quadrupole: 4.0212 2.0114 -1.2484
quadrupole: 36.7379 -22.5848 -14.1531 4.0212 2.0114 -1.2484
hfenergy: -1289.0504073 hartree
pointgroup: C01 [X(C12H7N1O5S1)]
dipole: -1.78844 0.7284163 0.5251625 debye
dipolederiv: 1.3545864 -0.0337267 -0.03772 -0.0327987 1.5077037 -0.0347606 0.0362101 -0.0565865 1.1770359 -0.6478243 -0.0110257 0.0412001 -0.0262919 -0.5550373 -0.0469228 -0.0902239 -0.1770884 -0.5701454 -0.5283684 -0.0154768 0.0075473 -0.0076532 -0.5502472 0.0408373 -0.0076943 0.2080903 -0.4954305 -0.5756973 -0.1191183 0.0175479 -0.2398333 -0.9647369 0.0640112 0.0094945 0.0575201 -0.2572884 -0.8241814 0.1301059 0.0279027 0.129233 -0.5639424 -0.2909941 0.0576013 -0.4165175 -0.569524 -0.8419213 -0.1635422 -0.156718 -0.2218533 -0.2571211 -0.1583703 -0.0250361 -0.1204362 -0.3144592 -1.9880374 -0.1250911 0.1975654 -0.1420711 -0.616441 -0.016343 0.219636 -0.0151238 -0.3520528 0.0880827 -0.0150425 -0.0165012 -0.0182211 -0.0755957 -0.0014091 -0.0114169 0.0102908 -0.1899375 -0.5536054 0.0670363 0.0618551 0.3418835 -0.1879291 -0.0439458 0.0617252 0.005899 0.0268419 1.5905457 0.4622874 -0.1240902 0.4028812 1.1244361 -0.0915231 -0.0383212 -0.1052697 0.2033999 -0.3501661 0.1337837 0.0282864 -0.2424656 0.0744237 0.0327625 0.0368753 -0.0136259 -0.0651703 2.599733 -0.3006808 -0.0571273 0.030778 0.5356304 0.4661375 -0.0653133 0.5516669 0.692406 -0.0334912 -0.0057505 -0.0054329 0.0393004 0.1076009 0.0011325 -0.0188332 0.0054614 -0.0722229 -0.6088418 -0.1645198 -0.200564 -0.428673 -0.2046374 -0.1422058 -0.4719582 -0.1732429 -0.1979844 0.0922931 -0.1312181 -0.0203567 0.0681684 0.0007341 -0.0061946 -0.0188063 0.0129347 -0.1139242 0.1614957 0.0990271 -0.0269438 0.0704687 -0.0450769 -0.0071943 -0.0243662 -0.0106208 -0.1178191 0.0836617 0.0261872 -0.0227481 -0.0462438 -0.1138818 0.0513637 -0.0799316 0.0579693 -0.048998 0.4251052 0.1966516 0.2105124 0.5063932 0.1628992 0.1959795 0.4685682 0.1405088 0.1100431 0.0749309 0.0350901 -0.0580348 -0.0655045 -0.0096204 0.1631541 -0.2019162 0.154169 0.1399966 0.1170169 -0.050749 0.0021186 -0.0034765 0.0236308 0.0004529 0.0022441 0.0026063 0.1538678 0.1077605 0.0261209 0.0076395 -0.0337299 0.0249912 0.0028498 0.0080642 -0.0051585 0.1571096 -0.041718 0.0731071 0.0212133 0.0589904 0.0444437 -0.0057153 0.0180826 -0.0076741 0.1598366 -0.0639263 -0.0538134 0.0221823 -0.0608228 0.0755268 0.0060813 0.0226192 0.0046515 0.1545919 0.1494564 -0.0205155 0.0079568 0.0240197 0.1428405 -0.0688851 0.0443011 -0.0509901 0.0906794 0.1795154 -0.0094582 0.0446817 -0.0547708 0.1415522 -0.0633262 0.0632152 -0.0084529 0.1604933 0.0335952 -0.0296685 0.0280274 -0.0477068 0.1778538 -0.0469721 0.0051804 -0.0509807 0.1386549 unknown
polarizability: 258.6566821|4.7676894|172.3557721|-14.4773425|18.6998955|109.1213377 unknown
InChI: InChI=1S/C12H7NO5S/c14-11(8-5-6-18-7-8)13-12(15)9-3-1-2-4-10(9)19(13,16)17/h1-7H
charge 0 multiplicity 1
26 atoms
S  -0.294161 1.40161 -0.096959
O  0.204782 2.057376 1.301923
O  0.058445 2.15591 -1.482762
O  -0.947406 -2.602244 -0.079686
O  1.485043 -1.886242 -1.620565
O  4.158259 0.96006 0.899862
N  0.191155 -0.526831 -0.217988
C  -2.091396 0.875034 0.042401
C  -2.20727 -0.522455 0.050817
C  -0.960465 -1.346948 -0.098358
C  -3.164741 1.763943 0.155854
C  1.459767 -0.952041 -0.779421
C  -3.495409 -1.085306 0.182914
C  2.658714 -0.246911 -0.314939
C  -4.451635 1.181946 0.282094
C  -4.61131 -0.226415 0.296397
C  3.955581 -0.339549 -0.96881
C  2.832883 0.549944 0.817764
C  4.83517 0.402784 -0.216038
H  -3.028021 2.848966 0.149811
H  -3.593941 -2.175508 0.188601
H  -5.327337 1.832517 0.371507
H  -5.61402 -0.653599 0.395784
H  4.163366 -0.898066 -1.878335
H  2.171845 0.896855 1.607565
H  5.890703 0.645269 -0.287733
