program: Gaussian 09
title: 000067112
version: EM64L-G09RevD.01
frameworkgroup: C1[X(C11H14O4)]
method: RPBEPBE
basis: SDD
operation: Freq
keyword: #pfreq=noraman
keyword: PBEPBE/SDD
title: #p freq=noraman PBEPBE/SDD
converged: YES YES NO NO
title: Mulliken charges:
elementType: O O O O C C C C C C C C C C C H H H H H H H H H H H H H H
charge: -0.281726 -0.291416 -0.411189 -0.230622 0.472005 0.239202 0.202028 -0.484227 -0.616488 -0.422586 -0.334080 -0.240936 0.211236 -0.687201 -0.522386 0.272657 0.236949 0.241963 0.236214 0.243883 0.207519 0.212994 0.210410 0.236071 0.226940 0.255961 0.212346 0.229508 0.374971
chargesum: 0.00000
title: Mulliken charges with hydrogens summed into heavy atoms:
elementType: O O O O C C C C C C C C C C C
charge: -0.281726 -0.291416 -0.036218 -0.230622 0.472005 0.239202 0.202028 -0.211569 -0.137575 -0.186372 -0.090197 0.179578 0.211236 -0.013780 0.175429
polarizability: 1.83434694e+02 2.96902669e+00 1.40638988e+02 6.77893226e+00 -8.27023048e-01 8.60024798e+01
1716.lowfreq: -9.0319 -0.0012 -0.0011 -0.0009 3.9737 6.5006 18.3523 31.7103 42.5280
frequency: 16.6525 31.6496 42.4876 60.2668 89.3683 104.8916 122.3613 133.6984 157.6031 193.2556 238.4982 250.7154 288.2449 312.1563 327.9183 372.2970 402.6242 453.2925 468.3690 489.1257 538.8390 567.7903 609.2118 636.2336 680.2322 718.4806 735.6705 763.0701 795.3625 829.8591 846.1158 880.8326 902.7536 906.6058 928.1603 929.6752 994.6244 1034.9568 1054.8552 1108.9630 1111.5484 1118.4704 1134.2452 1156.4882 1162.1932 1179.7946 1203.7298 1253.4616 1259.7847 1271.6977 1279.5385 1316.1078 1359.3998 1383.8612 1400.2044 1404.9469 1438.3392 1454.9517 1456.2370 1462.7425 1475.9100 1481.7373 1486.2008 1498.1066 1581.0593 1613.0440 1665.1102 2955.6669 2974.1576 2996.5208 3014.8028 3031.5766 3081.3321 3093.6690 3103.4096 3105.7766 3125.2851 3136.4024 3155.2703 3164.5539 3506.8305
redmass: 5.2965 8.8594 4.3680 2.4237 3.8719 1.8460 3.3730 1.7883 2.5926 3.4428 4.7789 1.1791 3.9011 4.2578 4.4438 4.6115 2.2290 4.4425 3.3698 4.6886 4.1778 3.1945 3.3024 2.0377 3.4351 4.3111 4.0569 3.7926 1.5758 1.2179 2.7940 4.3031 3.2246 1.8378 1.3879 2.0077 4.1095 2.7752 1.9371 2.4293 1.2613 2.2248 1.4294 1.3770 1.7377 1.2073 1.9198 3.3675 1.1471 1.3295 1.8207 2.2134 1.5145 3.3210 1.3831 1.9970 1.4710 1.0895 1.0808 1.0404 1.1528 1.0787 1.2259 1.7902 7.3483 6.6415 8.4997 1.0554 1.0343 1.0363 1.1075 1.0594 1.0979 1.0989 1.1037 1.1014 1.1042 1.0885 1.0920 1.0949 1.0639
irintensity: 0.0489 1.9482 0.8851 4.9198 1.3007 4.9783 0.4453 1.4171 0.9485 0.8113 4.2523 0.6694 5.2186 2.2420 2.7109 0.9480 3.0485 2.9863 3.8579 3.2913 55.7758 19.5038 38.0555 94.5979 45.9667 1.6547 11.1111 12.8361 48.6515 2.0788 17.8188 7.2421 28.9555 19.4826 1.2035 35.6060 38.6268 61.2049 220.7197 68.3214 4.3739 62.8575 4.4983 13.2705 6.7741 31.1153 88.1779 228.4371 0.0754 0.3618 25.0942 51.2612 15.1070 13.7846 29.3888 12.2680 11.0491 27.3433 14.6336 12.4643 61.0004 6.3440 72.5069 73.1370 20.6551 4.4770 230.0590 41.8480 78.9893 23.6027 33.5621 15.7266 35.2789 29.9706 4.8133 33.6453 18.7952 10.5078 3.4341 11.8360 19.5104
temp: 298.150 k
press: 1.00000 atm
elementType: 8 8 8 8 6 6 6 6 6 6 6 6 6 6 6 1 1 1 1 1 1 1 1 1 1 1 1 1 1
symmnumber: 1
zpe: 604544.4 jmol-1
zpe.correction: 0.230259 hartree
zpe.thermalcorrener: 0.246162 hartree
zpe.thermalcorrenthalpy: 0.247106 hartree
zpe.thermalcorrgfe: 0.184455 hartree
zpe.sumelectzpe: -727.307850 hartree
zpe.sumelectthermal: -727.291947 hartree
zpe.sumelectthermalent: -727.291003 hartree
zpe.sumelectthermalfe: -727.353654 hartree
dipole: 2.2567 -3.1968 1.5102
dipole: 4.1944
quadrupole: -77.1284 -86.6835 -86.3863
quadrupole: 2.0371 3.3775 1.5223
quadrupole: 6.2710 -3.2841 -2.9869 2.0371 3.3775 1.5223
hfenergy: -727.5381089 hartree
pointgroup: C01 [X(C11H14O4)]
dipole: -0.8030953 -1.2251814 -0.7596772 debye
polarizability: 181.893057|-2.9929356|140.0341755|14.1608225|5.0538644|88.1489291 unknown
InChI: InChI=1S/C11H14O4/c1-3-15-9-5-4-8(7-11(12)13)6-10(9)14-2/h4-6,12H,3,7H2,1-2H3
charge 0 multiplicity 1
29 atoms
O  -2.63952 -0.061219 -0.378789
O  -1.241416 2.255188 0.498723
O  4.332319 -0.820346 -0.854884
O  4.093413 1.426035 -0.312178
C  1.481061 -0.264779 0.664603
C  -1.271662 -0.179011 -0.077311
C  -0.599568 1.015343 0.335486
C  0.759818 0.953505 0.701148
C  2.95768 -0.299144 1.062104
C  0.816665 -1.434453 0.233789
C  -0.546898 -1.393011 -0.134815
C  -3.376576 -1.294798 -0.721573
C  3.835123 0.228815 -0.063987
C  -4.830481 -0.892097 -0.953387
C  -1.995732 2.797242 -0.65071
H  1.242179 1.886124 1.012141
H  3.266825 -1.328549 1.302833
H  3.131698 0.343682 1.941944
H  1.360236 -2.384411 0.183651
H  -1.040856 -2.316683 -0.449852
H  -2.934634 -1.749158 -1.632211
H  -3.286709 -2.017447 0.115178
H  -5.435913 -1.785207 -1.192761
H  -5.25028 -0.416499 -0.050845
H  -4.912356 -0.180911 -1.793213
H  -2.844286 2.144192 -0.911596
H  -1.327181 2.920951 -1.524862
H  -2.352675 3.782095 -0.312863
H  4.860228 -0.439046 -1.608665
