program: Gaussian 09
title: 000006068
version: EM64L-G09RevD.01
frameworkgroup: C1[X(C13H15NO2)]
method: RPBEPBE
basis: SDD
operation: Freq
keyword: #p
keyword: freq=noraman
keyword: PBEPBE/SDD
title: #p freq=noraman PBEPBE/SDD
converged: YES YES NO NO
title: Mulliken charges:
elementType: O O N C C C C C C C C C C C C C H H H H H H H H H H H H H H H
charge: -0.184553 -0.199953 -0.356443 0.037612 -0.208821 -0.407692 0.106449 0.486372 0.118426 -0.805964 -0.701405 -0.370713 -0.415148 -0.250551 -0.238167 -0.241880 0.276497 0.220867 0.242575 0.259589 0.230801 0.233426 0.344556 0.230069 0.217462 0.221463 0.226329 0.242742 0.227785 0.226774 0.231494
chargesum: 0.00000
title: Mulliken charges with hydrogens summed into heavy atoms:
elementType: O O N C C C C C C C C C C C C C
charge: -0.184553 -0.199953 -0.011887 0.037612 0.067676 0.055751 0.106449 0.486372 0.118426 -0.082147 -0.032411 -0.144384 -0.172406 -0.022765 -0.011393 -0.010387
polarizability: 1.79691728e+02 4.77711013e-01 1.26003168e+02 3.94055544e+00 7.20464861e+00 1.25485937e+02
1716.lowfreq: -10.1533 -6.4333 -1.6413 -0.0007 -0.0005 0.0009 40.1082 42.4104 74.8159
frequency: 39.9489 42.3107 74.8128 105.3765 141.5845 149.0797 177.2937 206.7118 253.4215 269.3089 281.6154 295.3145 302.9683 315.5925 369.2461 402.7804 424.2213 462.9140 502.1388 564.2899 604.8928 616.8516 628.3958 655.0736 694.0254 704.8841 718.6166 756.8232 764.1720 800.5696 833.4213 851.3328 865.4366 911.9625 926.0637 961.7806 976.8510 991.0934 996.0935 1013.9021 1030.1941 1064.5596 1071.9251 1093.3775 1096.7608 1120.4167 1166.1235 1174.9916 1191.2110 1198.7391 1206.9533 1252.6638 1261.6981 1268.1400 1310.7628 1324.5471 1325.4830 1343.9929 1378.6930 1388.8543 1397.6796 1435.2371 1469.4481 1474.0219 1479.5919 1484.4687 1486.1561 1493.1151 1591.6141 1614.2774 1658.6058 1694.5963 2966.3276 2981.0651 2992.7851 2999.4396 3044.8630 3077.2152 3080.6931 3085.7246 3100.6550 3107.6707 3127.3119 3139.8229 3152.8451 3166.1474 3538.0721
redmass: 5.0827 4.1141 4.9461 2.4857 5.7738 6.9722 2.0164 1.5060 2.9024 3.5033 2.5848 2.6044 3.9987 1.3622 3.3007 2.8101 5.0523 4.7825 3.3438 4.6843 9.5309 6.3818 2.9068 4.8848 2.6476 1.7126 3.0377 1.8443 1.7300 1.4622 3.2412 1.2558 2.0841 2.2749 1.4933 2.2652 1.3924 5.1201 1.3746 2.2142 2.0653 2.3448 1.8940 2.0080 1.6417 2.8019 3.1863 1.0605 2.8294 1.1202 1.7317 1.6337 2.4358 3.0994 1.3100 1.5047 1.5599 1.5144 7.0395 1.2017 1.1992 2.2122 1.0694 1.0476 1.0508 1.0806 2.0119 1.0863 6.0105 6.0336 7.5931 12.6090 1.0805 1.0361 1.0365 1.0600 1.1005 1.1001 1.0998 1.0992 1.1007 1.0882 1.0857 1.0915 1.0945 1.1009 1.0789
irintensity: 0.1230 0.0032 0.3534 0.1134 2.2756 7.7027 0.7691 0.4204 0.9085 2.3938 1.0177 1.0084 9.1397 2.5727 0.6146 0.0475 8.7875 3.1435 15.8738 6.1840 7.9100 0.2114 0.1879 6.3611 18.7411 46.0448 13.2303 48.5526 100.9236 4.9166 10.8827 0.1629 2.1602 2.3923 0.5576 29.6875 0.2949 0.9998 0.0731 6.8238 8.3376 4.1300 39.8950 14.4703 1.9835 52.8071 1.8620 0.1150 80.7504 0.9586 12.7200 38.3128 52.4473 89.5946 2.6679 4.3552 9.1536 0.3441 0.9845 18.9201 10.5910 8.5510 14.6155 14.9384 9.3617 12.7767 19.7008 6.4250 1.7040 5.7007 591.2570 67.1564 5.2449 24.4014 8.1694 22.1677 3.9233 43.4893 48.3879 26.8879 11.2575 15.3365 0.0773 18.1518 32.4123 17.3590 46.3484
temp: 298.150 k
press: 1.00000 atm
elementType: 8 8 7 6 6 6 6 6 6 6 6 6 6 6 6 6 1 1 1 1 1 1 1 1 1 1 1 1 1 1 1
symmnumber: 1
zpe: 662508.1 jmol-1
zpe.correction: 0.252336 hartree
zpe.thermalcorrener: 0.267123 hartree
zpe.thermalcorrenthalpy: 0.268067 hartree
zpe.thermalcorrgfe: 0.210418 hartree
zpe.sumelectzpe: -708.440801 hartree
zpe.sumelectthermal: -708.426014 hartree
zpe.sumelectthermalent: -708.425070 hartree
zpe.sumelectthermalfe: -708.482718 hartree
dipole: 1.5949 1.9783 0.3645
dipole: 2.5671
quadrupole: -98.6559 -99.9921 -91.1217
quadrupole: 6.0816 -6.6100 7.7542
quadrupole: -2.0660 -3.4022 5.4682 6.0816 -6.6100 7.7542
hfenergy: -708.6931366 hartree
pointgroup: C01 [X(C13H15N1O2)]
dipole: 0.6491149 0.7435478 0.2141839 debye
polarizability: 179.5501285|-1.6630747|124.8587778|4.7584457|7.0021586|126.7719264 unknown
InChI: InChI=1S/C13H15NO2/c1-3-10-11(15)14-12(16)13(10,2)9-7-5-4-6-8-9/h4-8,10,14H,3H2,1-2H3
charge 0 multiplicity 1
31 atoms
O  -0.537792 -2.70644 0.648115
O  -3.636368 0.286905 -1.188536
N  -2.247616 -1.430767 -0.355041
C  -0.419476 -0.181558 0.566614
C  -1.316509 0.754143 -0.342807
C  -1.691488 2.161707 0.171704
C  -1.00905 -1.60233 0.298709
C  1.067207 -0.130887 0.171006
C  -2.554754 -0.09341 -0.683333
C  -0.661006 0.062973 2.082251
C  -0.506428 3.151188 0.163505
C  1.450883 -0.55282 -1.130576
C  2.077581 0.329825 1.048792
C  2.797037 -0.504558 -1.546562
C  3.42891 0.383324 0.635476
C  3.795495 -0.030136 -0.663707
H  -0.781374 0.890654 -1.306525
H  -2.123528 2.091317 1.187462
H  -2.501592 2.541062 -0.479742
H  -0.111258 -0.686754 2.676615
H  -0.329187 1.069938 2.385951
H  -1.733871 -0.024428 2.329989
H  -2.881348 -2.210439 -0.550409
H  0.322983 2.811333 0.809243
H  -0.098254 3.271619 -0.857445
H  -0.82693 4.147295 0.518459
H  0.692996 -0.941409 -1.82397
H  1.825562 0.644315 2.066303
H  3.069199 -0.842368 -2.552719
H  4.194344 0.743622 1.332098
H  4.843033 0.007782 -0.982221
