program: Gaussian 09
title: 000067052
version: EM64L-G09RevD.01
frameworkgroup: C1[X(C7H3ClF3NO2)]
method: RPBEPBE
basis: SDD
operation: Freq
keyword: #p
keyword: freq=noraman
keyword: PBEPBE/SDD
title: #p freq=noraman PBEPBE/SDD
converged: NO YES NO NO
title: Mulliken charges:
elementType: Cl F F F O O N C C C C C C C H H H
charge: 0.008880 -0.169357 -0.138424 -0.138371 -0.196740 -0.163592 0.025156 0.192988 0.288836 -0.257000 0.306549 -0.328351 -0.130956 -0.184574 0.305607 0.302836 0.276513
chargesum: 0.00000
title: Mulliken charges with hydrogens summed into heavy atoms:
elementType: Cl F F F O O N C C C C C C C
charge: 0.008880 -0.169357 -0.138424 -0.138371 -0.196740 -0.163592 0.025156 0.192988 0.288836 0.048607 0.306549 -0.025515 -0.130956 0.091939
polarizability: 1.55693310e+02 -1.02853330e+01 1.12375423e+02 -3.78200377e-05 2.18677399e-02 4.46267890e+01
1716.lowfreq: -33.1018 -3.5325 -0.0020 -0.0017 -0.0012 3.8495 7.9371 76.1860 93.8527
frequency: -33.0197 76.1767 93.8488 145.7126 157.9858 188.0681 249.0923 254.7602 301.1204 316.8650 341.5115 359.9431 433.9426 459.6049 473.2641 517.8155 578.1924 598.0214 616.3997 654.2487 670.1745 724.1778 742.3971 808.4932 853.8802 905.3567 973.9144 989.5500 1018.5882 1030.9251 1069.9208 1105.1387 1150.4752 1197.6908 1232.0533 1268.6769 1372.3702 1385.5966 1409.6435 1460.9986 1573.6582 1602.0140 3177.4132 3193.3659 3198.5618
redmass: 16.7393 9.6975 9.1531 9.4625 18.5906 16.6994 14.4945 8.7036 19.7463 6.9127 14.4047 7.9138 4.2187 16.1320 8.1158 8.3296 8.2018 6.2086 11.2992 5.7243 8.8455 5.5428 11.9754 9.5110 1.4069 1.3931 7.7946 1.3357 10.9960 12.1791 5.8491 1.9624 1.5450 11.1908 3.6998 1.3500 4.5534 7.0976 9.5519 2.7049 7.2826 7.9503 1.0895 1.0966 1.0929
irintensity: 0.0565 3.3703 0.0043 0.2751 1.4298 0.8864 3.8877 0.6394 0.8139 0.3313 3.5194 0.2863 0.9191 5.6301 7.2288 16.6815 6.7298 1.8796 10.7322 17.2475 4.7684 2.4067 4.5011 84.9370 38.6728 28.7121 183.4205 4.1001 40.2472 228.4206 40.1528 50.7465 11.3902 220.6582 260.8838 28.6945 106.0563 21.2393 63.3772 14.5997 77.3646 16.9058 2.4097 6.3959 4.8955
temp: 298.150 k
press: 1.00000 atm
elementType: 17 9 9 9 8 8 7 6 6 6 6 6 6 6 1 1 1
symmnumber: 1
zpe: 244825.4 jmol-1
zpe.correction: 0.093249 hartree
zpe.thermalcorrener: 0.104401 hartree
zpe.thermalcorrenthalpy: 0.105345 hartree
zpe.thermalcorrgfe: 0.055508 hartree
zpe.sumelectzpe: -1232.224982 hartree
zpe.sumelectthermal: -1232.213831 hartree
zpe.sumelectthermalent: -1232.212887 hartree
zpe.sumelectthermalfe: -1232.262723 hartree
dipole: 5.0986 1.3794 0.0006
dipole: 5.2819
quadrupole: -95.6105 -86.5109 -85.6717
quadrupole: 5.4912 -0.0016 -0.0013
quadrupole: -6.3461 2.7535 3.5926 5.4912 -0.0016 -0.0013
hfenergy: -1232.3182315 hartree
pointgroup: C01 [X(C7H3Cl1F3N1O2)]
dipole: 2.0481659 0.3511471 0.0017418 debye
dipolederiv: -0.7712609 0.2601407 -0.0001878 0.2763285 -0.1879993 -0.0000021 -0.0001574 -0.0000438 -0.025337 -0.3981092 0.0496395 0.0004315 0.077191 -0.7849148 -0.0015466 0.0005777 -0.0012248 -0.2907581 -0.5136564 -0.095601 0.2498558 -0.1381299 -0.3829631 0.0192472 0.2397469 0.0107887 -0.6170132 -0.5141208 -0.0939703 -0.2501192 -0.1372861 -0.3831811 -0.0179085 -0.2397019 -0.0089895 -0.615356 -0.5365099 0.1340043 -0.0002007 0.1239577 -0.8349458 -0.0004648 -0.0003358 -0.0007568 -0.2208702 -0.7553526 -0.0904618 -0.000986 -0.0677154 -0.4919037 -0.0004529 -0.0004619 -0.0001628 -0.1708745 1.5958283 -0.2771424 0.0014906 -0.2713691 1.2630523 0.0010874 0.0018457 0.0008581 0.1857913 -0.0315318 -0.1236459 -0.0002264 -0.4391681 -0.0583187 -0.0001425 -0.0010145 -0.0000965 -0.1271818 -0.539574 0.2277234 -0.0001715 0.3461135 -0.095944 -0.0000126 -0.0002445 0.0001895 0.077574 -0.5715965 0.1612716 -0.0001806 -0.0653253 -0.037159 -0.000085 -0.0003669 0.0002154 -0.0447841 1.5257649 0.22681 0.0000016 0.3368201 1.6708727 0.0001178 -0.0005994 -0.0007196 1.5513187 0.1266135 -0.205728 -0.0000617 0.083882 -0.0526699 0.0000385 0.0001887 -0.0001068 -0.079648 1.3081096 -0.4618386 0.0002783 -0.3758 0.2951358 0.0001536 0.0003124 0.0001097 -0.0487883 -0.2079836 0.2715022 0.0001841 0.2802577 -0.1631375 0.0001637 0.000276 0.0000688 -0.0714669 0.1198173 0.0329273 0.0000159 0.0277691 0.089441 -0.0000135 0.0001577 0.0000092 0.1628399 0.1371269 0.0285209 0.0000064 -0.0149698 0.0813597 -0.0000629 -0.000143 -0.0000198 0.1721606 0.0264354 -0.0441518 -0.0001305 -0.0425561 0.0732754 -0.0001168 -0.0000799 -0.000119 0.1623938 unknown
polarizability: 153.3773132|-14.1685584|114.6913308|0.0616049|0.0565863|44.6268779 unknown
InChI: InChI=1S/C7H3ClF3NO2/c8-4-1-2-6(12(13)14)5(3-4)7(9,10)11/h1-3H
charge 0 multiplicity 1
17 atoms
Cl 4.111477 -0.785317 0.001387
F  -0.539589 -2.81895 -0.005635
F  -1.908101 -1.457289 1.144116
F  -1.911185 -1.451121 -1.144646
O  -1.495451 2.918465 0.001323
O  -2.539705 0.897332 -0.002934
N  -1.484394 1.627161 -0.000977
C  0.021804 -0.463143 -0.000324
C  -0.148061 0.95291 0.000594
C  1.343216 -0.968245 -0.000408
C  -1.093106 -1.505397 -0.00146
C  0.966978 1.819436 0.002262
C  2.442821 -0.089781 0.001149
C  2.276201 1.306646 0.002631
H  1.508485 -2.047109 -0.001374
H  0.779807 2.895861 0.002887
H  3.140403 1.975442 0.003807
