program: Gaussian 09
title: 000067050
version: EM64L-G09RevD.01
frameworkgroup: C1[X(C6H2O6)]
method: RPBEPBE
basis: SDD
operation: Freq
keyword: #p
keyword: freq=noraman
keyword: PBEPBE/SDD
title: #p freq=noraman PBEPBE/SDD
converged: NO NO NO NO
title: Mulliken charges:
elementType: O O O O O O C C C C C C H H
charge: -0.434916 -0.337760 -0.190283 -0.099302 -0.067129 -0.070914 0.174380 0.149764 0.030414 0.016666 0.001866 0.010408 0.408983 0.407823
chargesum: 0.00000
title: Mulliken charges with hydrogens summed into heavy atoms:
elementType: O O O O O O C C C C C C
charge: -0.025932 0.070063 -0.190283 -0.099302 -0.067129 -0.070914 0.174380 0.149764 0.030414 0.016666 0.001866 0.010408
polarizability: 1.20924764e+02 -1.48194720e+00 1.33104366e+02 -2.63382082e-03 8.18624970e-04 3.22945138e+01
1716.lowfreq: -12.9954 -4.8614 -4.5123 -0.0004 0.0004 0.0006 8.6252 60.9814 116.3049
frequency: -12.5264 60.9545 116.3000 214.0697 260.7058 282.0089 323.6922 333.7405 345.0652 388.1036 399.1827 404.8657 421.0751 497.6606 578.9670 613.8823 615.3251 653.5320 699.1125 794.4652 885.5298 964.3818 976.5461 1068.2641 1114.6738 1166.1739 1264.8427 1337.9519 1398.9898 1518.8721 1575.4395 1583.4717 1614.9530 1628.2569 3361.5083 3483.2135
redmass: 15.0811 12.5922 10.8411 9.2743 5.4815 7.2746 13.0722 12.5195 14.5705 11.5530 11.7294 12.8237 8.0205 11.9057 1.1549 7.8525 13.1103 1.1458 10.3863 6.9374 11.9531 6.0320 8.0183 7.3918 8.0704 1.6724 1.8808 7.2884 3.1939 12.1811 12.0095 10.9625 8.8401 13.0736 1.0635 1.0653
irintensity: 0.3216 1.0384 0.0166 7.5085 4.9391 8.9300 0.3601 14.5582 7.0446 8.1225 4.8636 6.8536 8.0037 1.2638 189.2383 4.0411 0.9736 131.1057 8.4494 33.2383 0.0060 96.0122 38.0153 26.4404 49.8054 149.5789 297.5043 173.5561 126.2116 279.1121 168.7101 302.6904 31.8584 1.8114 130.1099 151.0026
temp: 298.150 k
press: 1.00000 atm
elementType: 8 8 8 8 8 8 6 6 6 6 6 6 1 1
symmnumber: 1
zpe: 197059.5 jmol-1
zpe.correction: 0.075056 hartree
zpe.thermalcorrener: 0.084507 hartree
zpe.thermalcorrenthalpy: 0.085451 hartree
zpe.thermalcorrgfe: 0.039965 hartree
zpe.sumelectzpe: -680.252941 hartree
zpe.sumelectthermal: -680.243490 hartree
zpe.sumelectthermalent: -680.242546 hartree
zpe.sumelectthermalfe: -680.288032 hartree
dipole: 6.0454 -0.9371 0.0161
dipole: 6.1177
quadrupole: -68.5179 -86.2540 -63.0475
quadrupole: -1.2093 -0.0088 -0.0206
quadrupole: 4.0886 -13.6475 9.5589 -1.2093 -0.0088 -0.0206
hfenergy: -680.3279975 hartree
pointgroup: C01 [X(C6H2O6)]
dipole: 2.2520739 0.8492039 -0.006351 debye
dipolederiv: -1.0818862 -0.6934794 0.0002673 -0.5531875 -0.584586 -0.0006555 -0.0007123 -0.0004971 -0.3878403 -1.2371611 0.7720351 -0.0003418 0.4649129 -0.3783233 0.0004217 -0.0015195 0.0008605 -0.3568284 -0.3338271 -0.1399643 -0.0001197 0.1236076 -1.1159036 0.0019994 -0.0003495 -0.0037355 -0.3011463 -0.2807599 -0.0320828 0.0001539 -0.072762 -0.935681 -0.0014373 -0.0000676 0.0018097 -0.2581513 -0.6668162 0.225734 0.0006732 0.209972 -0.3858089 -0.0005945 0.0004759 0.0008477 -0.2415993 -0.6433993 -0.2051397 -0.000193 -0.2106849 -0.3557157 -0.0001469 0.0013734 0.0000543 -0.2399937 0.531428 1.0970787 -0.0000138 1.1990809 -0.1027618 0.0004986 0.0000362 -0.0020589 0.0593677 0.8413221 -1.0451189 0.0010873 -1.1789037 0.1748528 -0.0012321 0.0016152 0.0018846 0.130136 0.06092 -0.4502648 0.0002327 -0.2782611 1.3287624 -0.0008241 0.0016803 0.0054396 0.2059681 0.2163939 0.4636595 0.0003515 0.1809643 1.2157995 0.0014039 0.0005486 -0.0019499 0.1752142 0.8990171 -0.351297 -0.0007617 -0.1873926 0.3408803 -0.0003142 -0.0007071 -0.0032 0.2032336 0.8079947 0.3042377 -0.0009181 0.2459267 0.314897 0.0008734 -0.002429 0.0012144 0.2070577 0.3869761 0.2181328 -0.000376 0.1402428 0.3499704 0.0002559 -0.0003825 -0.0000362 0.3953149 0.4997978 -0.1635308 -0.0000418 -0.0835154 0.1336177 -0.0002483 0.0004377 -0.0006333 0.4092672 unknown
polarizability: 120.8426509|-1.090562|133.1864788|0.0024096|0.001342|32.2945138 unknown
InChI: InChI=1S/C6H2O6/c7-1-2(8)4(10)6(12)5(11)3(1)9/h7-8H
charge 0 multiplicity 1
14 atoms
O  2.422163 1.342037 0.000482
O  2.431773 -1.392521 0.001149
O  0.139192 2.77761 0.002959
O  0.026928 -2.788897 0.000837
O  -2.420637 1.439807 0.001126
O  -2.420518 -1.384852 0.001425
C  1.210663 0.680487 -0.000838
C  1.245656 -0.713488 -0.000523
C  0.004183 1.509961 -0.003292
C  0.007642 -1.532504 -0.002992
C  -1.345361 0.802677 0.000335
C  -1.340735 -0.758095 -0.001079
H  2.239567 2.329653 -0.001347
H  3.203983 -0.761375 0.002359
