program: Gaussian 09
title: 000067098
version: EM64L-G09RevD.01
frameworkgroup: C1[X(C19H25BrO3)]
method: RPBEPBE
basis: SDD
operation: Freq
keyword: #p
keyword: freq=noraman
keyword: PBEPBE/SDD
title: #p freq=noraman PBEPBE/SDD
converged: YES YES NO NO
title: Mulliken charges:
elementType: Br O O O C C C C C C C C C C C C C C C C C C C H H H H H H H H H H H H H H H H H H H H H H H H H
charge: -0.033363 -0.286544 -0.421083 -0.438301 0.395633 -0.109773 -0.107637 -0.234165 -0.585418 -0.189533 -0.557794 -0.045433 -0.527118 -0.507607 -0.853442 0.300130 -0.593071 0.320920 -0.337662 -0.593924 -0.507640 -0.416646 0.293920 0.229328 0.263969 0.214149 0.214877 0.229902 0.287175 0.240841 0.263982 0.179400 0.294796 0.218986 0.218969 0.289378 0.213202 0.213534 0.224599 0.224633 0.337060 0.211519 0.223059 0.202341 0.203535 0.236484 0.248527 0.351307
chargesum: 0.00000
title: Mulliken charges with hydrogens summed into heavy atoms:
elementType: Br O O O C C C C C C C C C C C C C C C C C C C
charge: -0.033363 -0.286544 -0.084023 -0.086994 0.395633 0.119554 0.156333 -0.020017 -0.140640 0.097642 -0.052971 0.133967 -0.232322 -0.069652 -0.137329 0.300130 -0.143839 0.320920 -0.126143 -0.370865 0.134720 -0.168119 0.293920
polarizability: 2.93298477e+02 -4.00001157e+00 2.12919422e+02 -3.73934193e+00 -1.19718565e+01 1.64739180e+02
1716.lowfreq: -0.4397 -0.0007 -0.0005 -0.0005 4.7564 9.3919 21.1274 36.6990 46.0914
frequency: 21.1142 36.6914 46.0778 58.7253 69.6119 97.6013 128.6297 141.8607 157.0990 168.6828 187.9392 210.1750 212.8245 232.0125 240.7439 244.8333 275.1452 291.7361 306.2730 313.8047 329.5519 337.7415 349.0857 360.2944 363.5691 395.7522 408.3165 441.1829 447.0709 459.0078 487.0688 513.9151 524.6932 554.3655 562.9901 586.0239 615.6085 634.0802 655.0574 696.7626 720.9328 732.9688 748.9319 789.9371 810.9057 829.6139 842.3770 858.8642 864.4110 897.0960 907.9208 920.6646 926.1157 950.4411 966.5289 975.1428 990.0119 1006.5905 1016.0060 1026.7724 1036.8483 1041.4107 1053.3413 1076.5242 1094.9543 1105.1046 1112.3870 1121.2145 1128.8739 1135.9176 1139.3348 1142.9871 1153.6688 1167.3479 1175.1336 1181.9841 1191.6727 1201.9806 1210.8055 1218.6029 1238.0566 1257.4238 1259.8040 1262.6944 1274.2520 1280.9939 1292.0546 1293.6880 1298.6864 1307.4978 1324.3529 1335.9114 1342.3967 1343.8561 1353.3092 1363.0840 1371.9120 1384.4706 1390.9156 1395.1351 1428.3088 1434.4315 1448.4366 1455.9861 1457.6800 1462.9871 1469.8807 1474.1004 1475.6435 1503.6929 1507.0070 1603.5972 1621.7301 2905.2993 2910.3538 2923.3697 2930.4823 2956.7099 2967.1977 2969.4850 2972.9011 2990.6396 2994.2100 3004.8266 3018.6769 3030.9080 3035.7643 3051.5409 3052.6139 3069.3602 3086.5346 3093.3833 3099.4179 3099.7691 3132.4280 3169.4937 3552.2249 3581.0792
redmass: 8.2687 5.1717 3.3906 2.7786 4.9581 4.9675 2.4843 2.4513 3.9832 6.4425 3.0000 2.1990 3.0473 1.9314 2.7735 2.0012 3.2993 3.3641 3.6641 4.0785 1.6426 1.8500 1.1419 2.7894 2.6485 2.7842 3.2946 2.7864 3.5817 3.9079 2.9541 4.3603 3.4171 3.4881 3.8660 3.9880 3.6716 4.2121 2.9845 3.4601 5.4659 3.4741 3.2904 2.9156 2.1619 1.6681 1.9968 2.3167 1.9403 2.5011 2.9420 2.3834 2.1347 1.3885 2.4170 2.2234 2.5479 2.6057 2.9975 2.7927 3.2288 2.3726 3.1590 2.1946 1.9544 1.6935 1.2745 1.7446 1.6226 1.5068 1.3925 1.3916 1.4059 1.6556 1.6659 1.5834 1.5861 1.6159 1.5285 1.5661 1.3780 1.7821 1.5119 1.8220 1.5267 1.5017 1.6969 1.5261 1.5757 1.4330 1.4076 1.4257 1.4671 1.3988 1.3373 1.5440 1.2596 3.6708 1.5230 1.2030 3.3894 1.1418 1.0761 1.1172 1.0671 1.0701 1.0923 1.0555 1.0618 2.7730 1.0536 6.6656 6.6567 1.0809 1.0795 1.0758 1.0394 1.0645 1.0629 1.0562 1.0466 1.0797 1.0695 1.1022 1.0942 1.0979 1.1013 1.0970 1.0870 1.0879 1.0959 1.0907 1.0975 1.0969 1.0879 1.0955 1.0655 1.0660
irintensity: 0.4827 0.3985 1.7497 2.3290 1.4588 0.5092 3.1480 0.4172 0.4699 1.0172 1.2778 1.0810 8.2990 0.6072 1.9759 2.4321 1.3231 38.2804 4.4873 1.4206 43.6191 67.3927 139.1112 9.4081 11.5562 9.6066 7.8377 12.1891 6.6657 14.7532 8.2602 0.7124 3.2336 4.4760 1.3876 20.5281 6.6723 9.1363 18.2566 6.1823 2.7814 2.8598 2.9353 12.2533 5.7770 1.0499 20.9555 6.6988 30.3905 14.4166 4.4519 20.2349 9.4967 1.8150 5.3537 23.3541 12.6991 25.1583 92.6084 7.9312 48.7175 25.7900 22.9272 10.2554 12.6314 5.5395 1.6033 0.8626 65.4945 214.5571 2.3204 11.6257 11.8313 1.4958 19.0773 3.0591 41.3916 6.5407 23.9581 6.4832 1.6877 16.2242 16.5442 4.0240 12.0906 1.3990 5.7363 4.5577 2.0215 0.6758 2.0368 0.2548 7.8945 3.5627 10.2721 3.4808 18.8277 13.4285 2.1890 28.3702 38.9791 4.2978 5.2790 6.3646 17.5537 19.8998 5.5481 6.2073 4.8143 81.5340 13.0047 9.7661 67.0727 16.2423 19.9104 40.9590 87.1757 27.6626 23.9266 55.4758 22.2144 12.2087 28.7584 66.7681 38.5360 25.9576 56.1205 42.0078 6.3309 18.0945 12.2654 25.7367 24.2442 3.4834 16.2278 10.7425 7.3279 36.8940
temp: 298.150 k
press: 1.00000 atm
elementType: 35 8 8 8 6 6 6 6 6 6 6 6 6 6 6 6 6 6 6 6 6 6 6 1 1 1 1 1 1 1 1 1 1 1 1 1 1 1 1 1 1 1 1 1 1 1 1 1
symmnumber: 1
zpe: 1052406.9 jmol-1
zpe.correction: 0.400841 hartree
zpe.thermalcorrener: 0.422953 hartree
zpe.thermalcorrenthalpy: 0.423897 hartree
zpe.thermalcorrgfe: 0.349398 hartree
zpe.sumelectzpe: -976.389660 hartree
zpe.sumelectthermal: -976.367548 hartree
zpe.sumelectthermalent: -976.366604 hartree
zpe.sumelectthermalfe: -976.441103 hartree
dipole: -2.1676 0.0916 2.4661
dipole: 3.2846
quadrupole: -175.7220 -135.4210 -143.0378
quadrupole: 7.9446 3.7626 -3.4796
quadrupole: -24.3284 15.9726 8.3558 7.9446 3.7626 -3.4796
hfenergy: -976.790501 hartree
pointgroup: C01 [X(C19H25Br1O3)]
dipole: 0.7839966 -0.0623418 1.0253917 debye
polarizability: 288.5781672|-16.5685866|218.4577786|14.0349151|3.8729342|163.9211333 unknown
InChI: InChI=1S/C19H25BrO3/c1-19-9-16(23-2)17-12-6-4-11(21)7-10(12)3-5-13(17)14(19)8-15(20)18(19)22/h4,6-7,13-18,21-22H,3,5,8-9H2,1-2H3
charge 0 multiplicity 1
48 atoms
Br -5.222682 2.338052 -1.207082
O  0.235497 -2.094028 0.773805
O  -4.923252 -1.23783 -0.171923
O  6.20931 0.157284 -0.035414
C  -2.455699 -0.554968 0.060248
C  -1.80887 0.856295 -0.102379
C  -0.333033 0.888013 0.330661
C  0.448988 -0.091374 -0.599073
C  -1.667821 -1.56157 -0.808897
C  -3.900399 -0.237571 -0.459613
C  -2.84226 1.814121 0.537821
C  -0.133592 -1.531223 -0.539798
C  -4.20508 1.176354 0.142466
C  0.306094 2.289015 0.253402
C  -2.533987 -1.043807 1.53207
C  1.969127 -0.020268 -0.390572
C  1.739292 2.245518 0.820066
C  2.572095 1.102777 0.243585
C  2.821203 -1.041595 -0.887633
C  3.982737 1.169577 0.365526
C  0.198311 -3.5530 0.81893
C  4.220779 -0.981344 -0.768039
C  4.80373 0.136428 -0.132049
H  -1.822281 1.07443 -1.196655
H  -0.240881 0.530598 1.376996
H  0.244191 0.253064 -1.640305
H  -1.818758 -1.31562 -1.880945
H  -2.052428 -2.589858 -0.667596
H  -3.891255 -0.187569 -1.561725
H  -2.744891 1.833947 1.640783
H  -2.751568 2.851644 0.180922
H  0.346877 -2.152879 -1.32976
H  -4.926062 1.120548 0.974635
H  -0.296193 3.020614 0.825138
H  0.321504 2.632353 -0.801764
H  -1.527302 -1.184026 1.953482
H  -3.097533 -0.349015 2.183811
H  -3.033872 -2.030974 1.570853
H  1.681493 2.123891 1.922366
H  2.255316 3.208792 0.642385
H  -5.035547 -1.314929 0.809931
H  2.38686 -1.917105 -1.382335
H  4.435423 2.044867 0.853733
H  0.844389 -3.994605 0.030409
H  -0.830701 -3.953242 0.704487
H  0.5882 -3.837622 1.809143
H  4.866613 -1.77541 -1.1536
H  6.515214 0.975749 0.428505
