program: Gaussian 09
title: 000067040
version: EM64L-G09RevD.01
frameworkgroup: C1[X(C12H13NO)]
method: RPBEPBE
basis: SDD
operation: Freq
keyword: #p
keyword: freq=noraman
keyword: PBEPBE/SDD
title: #p freq=noraman PBEPBE/SDD
converged: YES YES NO NO
title: Mulliken charges:
elementType: O N C C C C C C C C C C C C H H H H H H H H H H H H H
charge: -0.312087 -0.688757 0.263285 0.453817 0.108787 0.201536 -0.517803 -0.345770 -0.365614 -0.435558 -0.271059 -0.252217 -0.230660 -0.690571 0.232719 0.238400 0.198069 0.236902 0.223013 0.223781 0.207442 0.207426 0.338397 0.308179 0.209712 0.229292 0.229341
chargesum: 0.00000
title: Mulliken charges with hydrogens summed into heavy atoms:
elementType: O N C C C C C C C C C C C C
charge: -0.312087 -0.042182 0.263285 0.453817 0.108787 0.201536 -0.285084 -0.107370 -0.167546 -0.198656 -0.048046 -0.028436 0.184208 -0.022227
polarizability: 2.29838863e+02 -3.08642451e+00 1.53318631e+02 3.67260946e-03 4.98397758e-03 6.57662318e+01
1716.lowfreq: 0.0006 0.0007 0.0009 8.0685 12.9454 20.1306 43.7803 104.2110 114.3040
frequency: 43.7721 104.1989 114.3018 123.9457 136.2687 236.2212 243.4274 281.4798 292.7505 301.0628 329.8861 335.5771 421.5800 458.2109 490.6063 494.9986 514.4698 549.4525 566.4849 591.3909 673.7406 702.3554 712.8085 737.6926 786.7307 789.5442 830.1401 830.5802 863.7569 866.6339 917.0597 933.4544 946.7016 979.5879 1027.1564 1042.2928 1091.8557 1113.0341 1128.6541 1138.7197 1157.4059 1174.7613 1204.0086 1236.6010 1263.6252 1268.6719 1290.4796 1368.0355 1395.4045 1397.8916 1410.1289 1425.4420 1450.8789 1462.1155 1477.0643 1483.7666 1494.3116 1522.8838 1583.4941 1596.4831 1622.4707 1632.7374 2954.1589 2995.3625 3010.8143 3093.3166 3102.6751 3112.5292 3119.2223 3135.7845 3138.2853 3158.8711 3162.6247 3571.5066 3722.5190
redmass: 3.9431 1.7931 3.1965 3.4978 4.2055 3.9066 1.1675 3.7109 1.2876 4.7377 4.9378 3.2977 2.6813 4.5271 5.8646 1.1212 3.4543 5.5419 3.1901 5.2490 3.9158 5.4495 5.1198 1.3188 2.7628 1.4348 3.6894 1.0980 1.7787 4.0791 1.3400 2.3895 1.3982 1.3437 2.3761 2.6924 2.7026 2.1380 2.0089 1.4372 1.2690 1.1109 2.3617 1.7821 1.1400 1.7929 2.2794 1.3278 2.3974 1.5673 2.2536 5.5630 2.7635 1.0404 1.4095 1.6351 1.2277 3.8749 3.8068 5.1882 1.5187 6.3453 1.0554 1.0360 1.1074 1.0989 1.1014 1.0850 1.0879 1.0875 1.0939 1.1002 1.0955 1.0451 1.1030
irintensity: 1.6476 0.2935 7.3963 1.2185 2.8601 6.1337 2.6638 0.4020 135.0375 2.1521 2.1674 2.5301 43.5887 0.9664 0.8015 91.5432 0.8219 8.2801 15.2711 2.4138 10.0521 22.3020 0.2230 26.1075 26.1772 85.7091 3.2365 0.5845 8.3110 2.5703 0.3950 21.4692 4.2574 0.5252 14.5850 45.2927 82.2905 13.5873 144.2013 4.4295 5.8787 2.2509 182.3123 2.1234 0.0335 38.5624 29.5099 20.8278 2.4126 62.1817 19.4774 61.1197 9.5299 11.9525 64.7174 57.1684 3.5952 24.2695 3.5691 24.5586 261.2951 25.0276 50.6963 27.8849 37.1123 31.0777 37.7826 9.4983 0.3853 2.5298 43.8153 46.1956 14.8230 79.1089 32.0376
temp: 298.150 k
press: 1.00000 atm
elementType: 8 7 6 6 6 6 6 6 6 6 6 6 6 6 1 1 1 1 1 1 1 1 1 1 1 1 1
symmnumber: 1
zpe: 579823.5 jmol-1
zpe.correction: 0.220843 hartree
zpe.thermalcorrener: 0.233521 hartree
zpe.thermalcorrenthalpy: 0.234465 hartree
zpe.thermalcorrgfe: 0.182164 hartree
zpe.sumelectzpe: -594.051856 hartree
zpe.sumelectthermal: -594.039179 hartree
zpe.sumelectthermalent: -594.038234 hartree
zpe.sumelectthermalfe: -594.090536 hartree
dipole: 2.1918 0.5326 -0.0101
dipole: 2.2556
quadrupole: -68.1927 -69.8540 -89.3813
quadrupole: -3.1520 -0.0058 -0.0331
quadrupole: 7.6166 5.9553 -13.5720 -3.1520 -0.0058 -0.0331
hfenergy: -594.2726996 hartree
pointgroup: C01 [X(C12H13N1O1)]
dipole: -0.8620929 -0.2097753 0.0177164 debye
polarizability: 229.4577708|-2.5665634|152.5889938|-7.9909878|8.0333983|66.8769608 unknown
InChI: InChI=1S/C12H13NO/c1-2-14-11-8-7-9-5-3-4-6-10(9)12(11)13/h3-8H,2,13H2,1H3
charge 0 multiplicity 1
27 atoms
O  -2.616662 -0.445945 0.19496
N  -0.714898 -2.263266 -0.060639
C  1.087915 -0.54651 0.010962
C  1.427709 0.861687 0.122883
C  -0.300245 -0.939391 0.040479
C  -1.294314 0.062245 0.179051
C  0.389202 1.833428 0.260478
C  -0.953625 1.436334 0.288063
C  2.152954 -1.49961 -0.126056
C  2.811534 1.242784 0.092032
C  3.489601 -1.094872 -0.152823
C  3.824534 0.292684 -0.042637
C  -3.723798 0.512658 0.335071
C  -5.019338 -0.295769 0.323367
H  0.652862 2.893071 0.344625
H  -1.739286 2.190652 0.393656
H  1.931162 -2.570262 -0.212371
H  3.060298 2.307739 0.177759
H  4.286095 -1.839834 -0.25821
H  4.875308 0.602104 -0.064401
H  -3.609535 1.072802 1.286181
H  -3.695189 1.235799 -0.506053
H  -1.71292 -2.45452 -0.032118
H  -0.057605 -3.026815 -0.166296
H  -5.888682 0.379128 0.424165
H  -5.120453 -0.856005 -0.622095
H  -5.037527 -1.015517 1.159766
