program: Gaussian 09
title: 000067037
version: EM64L-G09RevD.01
frameworkgroup: C1[X(C14H10ClNO3)]
method: RPBEPBE
basis: SDD
operation: Freq
keyword: #p
keyword: freq=noraman
keyword: PBEPBE/SDD
title: #p freq=noraman PBEPBE/SDD
converged: YES YES NO NO
title: Mulliken charges:
elementType: Cl O O O N C C C C C C C C C C C C C C H H H H H H H H H H
charge: -0.065287 -0.198274 -0.438795 -0.227668 -0.698324 0.247622 0.437812 -0.014842 0.101417 -0.535534 -0.359235 -0.414433 0.631391 -0.336203 -0.221344 -0.366273 -0.225267 -0.222593 0.086139 0.241110 0.265286 0.277970 0.281533 0.253099 0.239349 0.238440 0.313592 0.320781 0.388532
chargesum: 0.00000
title: Mulliken charges with hydrogens summed into heavy atoms:
elementType: Cl O O O N C C C C C C C C C C C C C C
charge: -0.065287 -0.198274 -0.050263 -0.227668 -0.063950 0.247622 0.437812 -0.014842 0.101417 -0.294424 -0.093949 -0.136463 0.631391 -0.054671 0.031755 -0.366273 0.014082 0.015847 0.086139
polarizability: 2.40012254e+02 -2.12780483e+00 1.64383701e+02 2.77128110e+01 1.21594774e+01 1.42927589e+02
1716.lowfreq: -3.9777 -0.0012 0.0005 0.0012 3.6038 11.4044 17.7118 33.8799 49.2098
frequency: 15.9361 33.7418 49.2019 68.6863 97.1728 115.4440 125.7551 182.1378 193.9360 231.5744 239.7838 255.7350 283.6222 316.3893 373.3880 378.3402 390.5401 402.1457 412.2545 427.3801 458.2956 498.5685 519.3299 554.6620 561.0814 588.8911 590.1110 601.0019 647.5435 684.8590 693.8844 709.8807 729.9385 761.2066 781.3757 791.7576 827.3373 868.3890 881.0671 898.7367 959.5900 966.3370 975.8307 1000.6442 1004.7114 1005.6845 1041.6008 1056.2421 1100.0305 1142.1674 1146.7196 1163.5509 1178.5968 1242.0155 1271.0840 1279.5577 1319.0835 1321.8723 1379.2113 1397.1990 1427.4900 1432.7508 1474.2445 1485.3498 1551.3533 1574.3636 1583.6877 1601.9024 1611.3269 1637.5457 1638.7351 3131.0080 3137.3523 3151.9217 3160.7534 3165.3227 3179.9441 3181.7619 3529.9408 3556.3660 3703.0586
redmass: 8.0198 4.9322 7.2180 10.7926 8.3449 6.2112 6.8369 7.5454 5.1018 6.2852 5.3294 5.7632 5.0958 10.8792 6.3604 5.9459 1.2212 4.4997 3.2981 2.2866 1.2670 5.9488 4.4200 6.6832 5.5359 3.1476 1.6725 3.1815 6.0922 4.0733 6.1886 4.4105 2.8147 4.3933 2.5744 2.0311 1.4737 4.9369 1.7848 1.5192 1.3593 2.8904 1.4705 4.6759 1.8115 2.5661 2.3316 1.7567 2.1845 1.2560 1.9809 1.7394 1.0745 2.2042 1.5329 1.4909 2.6169 2.8453 10.5681 7.6580 2.2009 4.7078 2.6846 3.4086 10.1703 6.9749 7.3593 6.2498 2.3054 3.2829 2.6730 1.0906 1.0862 1.0910 1.0887 1.0966 1.0979 1.0969 1.0642 1.0454 1.1037
irintensity: 0.2326 0.1682 1.1572 0.2013 3.7449 0.1932 0.7822 2.4902 0.7993 1.0336 5.5400 4.1196 15.2300 2.0767 7.3107 5.3544 115.5346 26.2284 10.8577 53.4586 101.6415 9.8037 5.4001 14.2801 8.0130 19.8183 76.6047 33.8128 8.0180 48.6288 0.3575 47.0182 50.3220 21.5589 26.4042 20.7305 13.9982 33.2658 22.8649 1.5166 0.4048 39.5197 8.4627 199.6298 35.7260 74.2728 3.9162 53.2155 64.6517 12.7403 11.0312 73.9926 0.5058 129.9796 2.9250 23.1112 89.8030 147.4616 10.0817 17.3311 6.1663 25.8366 14.5006 37.7240 254.5446 20.1822 23.3850 13.1680 3.4775 108.8324 366.5434 7.0189 1.8889 9.0960 1.6939 13.4472 11.5008 2.9731 49.8904 74.7472 30.5269
temp: 298.150 k
press: 1.00000 atm
elementType: 17 8 8 8 7 6 6 6 6 6 6 6 6 6 6 6 6 6 6 1 1 1 1 1 1 1 1 1 1
symmnumber: 1
zpe: 544952.8 jmol-1
zpe.correction: 0.207562 hartree
zpe.thermalcorrener: 0.224457 hartree
zpe.thermalcorrenthalpy: 0.225401 hartree
zpe.thermalcorrgfe: 0.161096 hartree
zpe.sumelectzpe: -1278.666093 hartree
zpe.sumelectthermal: -1278.649198 hartree
zpe.sumelectthermalent: -1278.648253 hartree
zpe.sumelectthermalfe: -1278.712559 hartree
dipole: -1.5181 -4.3480 -3.6366
dipole: 5.8681
quadrupole: -108.6403 -113.1391 -108.7908
quadrupole: 3.9776 6.2261 -3.1532
quadrupole: 1.5498 -2.9490 1.3992 3.9776 6.2261 -3.1532
hfenergy: -1278.8736546 hartree
pointgroup: C01 [X(C14H10Cl1N1O3)]
dipole: -0.6682684 1.7301016 -1.3748683 debye
polarizability: 236.8324018|-30.3162859|149.3603477|-13.8348942|-12.5447938|161.1307942 unknown
InChI: InChI=1S/C14H10ClNO3/c15-11-6-5-8(7-12(11)16)13(17)9-3-1-2-4-10(9)14(18)19/h1-7,18H,16H2
charge 0 multiplicity 1
29 atoms
Cl 5.256452 0.317858 -0.960836
O  -0.489921 -1.290861 2.414712
O  -2.121354 -1.166453 -2.60793
O  -0.782468 -2.067818 -0.941255
N  2.762078 1.932602 -1.631091
C  -1.538481 0.167635 0.821208
C  1.014198 -0.357767 0.769675
C  -0.335717 -0.581249 1.377344
C  -2.112864 -0.072814 -0.462389
C  1.238763 0.679971 -0.165144
C  -2.125826 1.146468 1.658853
C  2.087509 -1.189949 1.185641
C  2.530879 0.914559 -0.715907
C  -3.233292 0.685513 -0.893424
C  3.372941 -0.980925 0.652584
C  3.576766 0.052325 -0.277704
C  -3.238552 1.899803 1.224551
C  -3.789575 1.67508 -0.05883
C  -1.590627 -1.181461 -1.3067
H  0.413483 1.333881 -0.470758
H  -1.703257 1.31074 2.655294
H  1.892965 -1.984812 1.910279
H  -3.66247 0.473818 -1.876427
H  4.214339 -1.613465 0.950098
H  -3.675357 2.655069 1.886834
H  -4.654832 2.254442 -0.397424
H  2.005188 2.534133 -1.940398
H  3.696476 2.077296 -2.005731
H  -1.757543 -1.946819 -3.106126
