program: Gaussian 09
title: 000067025
version: EM64L-G09RevD.01
frameworkgroup: C1[X(C10H8O4S)]
method: RPBEPBE
basis: SDD
operation: Freq
keyword: #p
keyword: freq=noraman
keyword: PBEPBE/SDD
title: #p freq=noraman PBEPBE/SDD
converged: NO YES NO NO
title: Mulliken charges:
elementType: S O O O O C C C C C C C C C C H H H H H H H H
charge: 0.964344 -0.439158 -0.562763 -0.504870 -0.503871 0.500576 0.207892 -0.239142 -0.409933 -0.367783 -0.279132 0.171419 -0.224220 -0.211722 -0.421510 0.281154 0.296852 0.284060 0.247198 0.234327 0.227610 0.368244 0.380430
chargesum: 0.00000
title: Mulliken charges with hydrogens summed into heavy atoms:
elementType: S O O O O C C C C C C C C C C
charge: 0.964344 -0.070914 -0.182333 -0.504870 -0.503871 0.500576 0.207892 -0.239142 -0.128779 -0.083722 0.017720 0.171419 0.022978 0.022605 -0.193900
polarizability: 1.99269718e+02 -1.05018082e+01 1.75421525e+02 1.55993827e+00 5.96037598e-01 7.44535138e+01
1716.lowfreq: -7.8530 -5.7135 0.0010 0.0013 0.0018 5.5929 40.6486 63.0822 130.0576
frequency: 40.6276 63.0815 130.0564 145.0763 167.8480 179.6958 215.7022 228.1309 238.3562 269.4290 293.1987 323.1518 338.5684 371.3323 416.6554 466.5683 472.2070 481.0822 508.8427 513.9453 545.8283 579.4314 585.8256 648.3324 738.4175 748.1815 777.9718 800.3441 830.2219 836.0208 856.2093 876.4036 949.5894 955.8614 974.3754 1002.4010 1015.5431 1048.9361 1063.6930 1090.0792 1140.9690 1177.3434 1196.8146 1208.7752 1261.7679 1264.3573 1376.7828 1395.0753 1415.6220 1441.8846 1453.7620 1513.7768 1576.0008 1594.4151 1636.2900 3124.5877 3149.7411 3155.1830 3163.2151 3181.7574 3182.5758 3477.6902 3590.0504
redmass: 8.3933 6.6966 6.9773 7.3515 1.7791 3.4524 5.3978 6.3409 3.3223 4.5344 4.6045 7.6996 8.2934 1.1426 10.7631 3.3270 5.8949 5.5959 5.5578 6.4803 11.6705 3.1507 7.2152 4.8615 1.4922 7.4811 5.6289 1.3892 5.8720 3.2179 5.2051 1.4984 1.4044 9.9649 1.3638 1.3587 3.9259 1.1800 2.3692 2.0440 1.4834 1.1461 1.3170 1.7853 2.0988 1.8619 2.1840 3.6485 4.4406 2.6211 2.6024 3.9247 7.4921 5.8722 7.2112 1.0896 1.0882 1.0918 1.0920 1.0985 1.0970 1.0661 1.0661
irintensity: 0.2244 0.3278 2.1663 2.5297 46.6049 5.1057 5.6683 5.9567 31.3387 2.7685 35.6253 35.4271 17.4864 129.3866 73.3702 0.8471 2.8749 25.0746 5.0713 7.8968 112.1839 1.8068 21.6317 7.3006 4.4597 8.4909 1.7031 136.3703 69.2353 17.0895 17.1746 2.8606 3.5289 90.2653 1.6796 2.5773 107.1855 90.1631 6.7426 2.8922 64.3234 26.4929 1.1101 48.8423 31.4787 50.9557 19.0782 26.4089 25.0505 11.2808 22.5621 12.2324 62.4119 15.8242 15.3853 16.6239 6.0187 10.5073 4.4404 6.2786 5.9809 42.0647 52.6460
temp: 298.150 k
press: 1.00000 atm
elementType: 16 8 8 8 8 6 6 6 6 6 6 6 6 6 6 1 1 1 1 1 1 1 1
symmnumber: 1
zpe: 415496.9 jmol-1
zpe.correction: 0.158254 hartree
zpe.thermalcorrener: 0.172014 hartree
zpe.thermalcorrenthalpy: 0.172958 hartree
zpe.thermalcorrgfe: 0.117946 hartree
zpe.sumelectzpe: -1083.575834 hartree
zpe.sumelectthermal: -1083.562075 hartree
zpe.sumelectthermalent: -1083.561131 hartree
zpe.sumelectthermalfe: -1083.616142 hartree
dipole: 5.6087 -0.5345 1.3523
dipole: 5.7942
quadrupole: -83.8210 -83.5586 -101.2568
quadrupole: -3.0602 -7.0346 -3.7403
quadrupole: 5.7244 5.9869 -11.7113 -3.0602 -7.0346 -3.7403
hfenergy: -1083.7340886 hartree
pointgroup: C01 [X(C10H8O4S1)]
dipole: -2.2213234 0.14836 0.4902094 debye
dipolederiv: 1.9435868 0.1262209 0.0392084 0.3033883 1.22757 0.0989693 0.2108632 0.1255842 1.5798907 -1.259568 -0.4363202 -0.0076616 -0.6542128 -0.3287507 0.002383 -0.0013177 0.0041545 -0.4062503 -0.5201238 0.02888 -0.1555321 -0.0276497 -0.5396595 -0.2037932 -0.2837557 -0.19235 -0.9573732 -0.7907506 0.0713371 0.0364292 0.0454321 -0.5386929 -0.0571134 -0.0175859 -0.0043648 -0.4659844 -0.6931353 -0.0694574 -0.0121618 -0.1006471 -0.5705287 0.1356175 -0.0063127 0.0438965 -0.5495073 -0.1688115 0.0575391 -0.0062749 -0.5951596 0.1935332 -0.0135387 0.0022652 -0.0024587 0.0717656 -0.168392 -0.3059734 -0.0054159 0.2565434 -0.0910568 0.004749 -0.00814 -0.0020027 0.0151176 -0.0202972 0.0337547 0.001877 -0.0058804 -0.1484648 0.017118 0.110325 0.0618479 -0.1613905 -0.1685098 0.1377493 0.0072317 0.2418233 -0.2098464 0.008006 0.0089864 -0.0196867 -0.144617 0.1390711 0.0691192 0.0005516 -0.2090866 0.0616195 -0.0011936 -0.0033823 0.0027455 -0.0994509 -0.0925165 -0.0645205 -0.0026927 0.3111586 -0.0250085 0.0036977 -0.0154355 -0.010045 -0.0797117 1.1973258 0.3548291 0.0033694 0.6220736 0.3100948 0.0005729 -0.0004905 0.0021816 0.0677413 -0.2865192 0.0338184 -0.0049179 0.0296132 0.1125938 0.0006083 -0.0083139 -0.0036321 -0.1658488 0.305267 -0.0585135 -0.0016889 0.1186577 0.1833059 0.001628 0.0040442 0.0040097 -0.1114184 -0.127628 0.0048758 -0.0042887 -0.4371021 -0.2276388 -0.0002032 -0.0095448 -0.0006681 -0.2095371 0.0652453 -0.0666079 0.0037483 -0.0176516 0.0819625 -0.0039051 -0.0163174 0.0145775 0.142771 0.0883636 0.0550843 0.007817 0.0323105 0.1411638 0.0044688 0.0066386 0.0010805 0.1584445 0.0382747 -0.0770251 -0.000592 -0.0393741 0.0762487 -0.0013076 -0.0011282 -0.0014153 0.1557846 0.0531504 -0.0049765 -0.0008812 -0.0143844 -0.0902572 -0.0045324 0.0060458 -0.0010087 0.1681396 0.0835664 0.008363 0.0012117 0.0170606 -0.0987802 -0.0022921 0.000697 -0.0019319 0.1530861 -0.120109 0.0800014 0.0019516 0.057082 0.0659711 -0.0018659 0.0026083 -0.0017404 0.1774559 0.3482655 0.0988899 0.002664 0.1893187 0.1451068 -0.004186 0.0043576 -0.0039405 0.3874668 0.1542444 -0.0770675 0.0960478 -0.1233135 0.2695142 0.0161128 0.0148934 -0.014833 0.2734259 unknown
polarizability: 199.7315741|-9.9751991|174.9418123|0.7869396|1.8760124|74.4713706 unknown
InChI: InChI=1S/C10H8O4S/c11-9-5-1-4-8-7(9)3-2-6-10(8)15(12,13)14/h1-6,11-12H
charge 0 multiplicity 1
23 atoms
S  2.697106 0.259166 -0.03128
O  -3.835871 -0.637761 -0.003216
O  2.631622 0.824712 1.740953
O  3.84037 -0.876813 -0.184356
O  2.779298 1.583307 -0.961083
C  -0.199235 0.217798 -0.016479
C  -1.432018 -0.554339 -0.0195
C  1.000599 -0.563906 -0.028247
C  -0.255634 1.649492 -0.002253
C  -1.396076 -1.983896 -0.035053
C  1.048137 -1.953285 -0.040889
C  -2.681224 0.159138 -0.001556
C  -0.18241 -2.674553 -0.048771
C  -1.495141 2.291794 0.014469
C  -2.717134 1.556311 0.0158
H  0.667845 2.232441 -0.019078
H  2.013089 -2.470591 -0.048624
H  -2.347177 -2.523228 -0.037302
H  -0.163735 -3.768209 -0.061832
H  -1.536954 3.385774 0.024666
H  -3.675547 2.090142 0.029325
H  -4.652911 -0.080656 0.010831
H  3.4652 1.352562 1.913676
