program: Orca
programVersion: 5.0.4
elementType: S P O O O O N C C C C C C C C C C C H H H H H H H H H H H H H H H H
charge: 0
multiplicity: 1
keywords: wb97x-d3
keywords: def2-TZVPP
keywords: def2/J RIJCOSX
keywords: DEFGRID2
keywords: scfconv7
keywords: smallprint printgap noloewdin
keywords: NOSOSCF
formula: C11H16NO4PS
InChI: InChI=1/C11H16NO4PS/c1-8(2)15-11(13)9-6-4-5-7-10(9)16-17(12,18)14-3/h4-8H,12H2,1-3H3
34 atoms
S  -3.856326 -0.337728 -0.194561
P  -2.063184 -0.832711 0.266762
O  2.541836 -0.332676 -0.323884
O  -1.242419 0.208639 1.22333
O  -1.067607 -1.00426 -0.993913
O  1.170973 -1.096449 1.267137
N  -1.902653 -2.178919 1.183261
C  3.361484 -1.513243 -0.262198
C  0.806945 1.072332 0.3233
C  -0.528512 1.240831 0.702339
C  1.495748 -0.23656 0.491614
C  3.988729 -1.668559 -1.632829
C  4.393919 -1.369637 0.8404
C  1.486496 2.169919 -0.205279
C  -1.16152 2.465469 0.546987
C  0.863909 3.397431 -0.345331
C  -0.462716 3.543805 0.03213
C  -1.221372 -0.280279 -2.206269
H  2.722867 -2.374331 -0.052536
H  4.601517 -2.569552 -1.658385
H  3.229197 -1.75994 -2.408935
H  4.630456 -0.821267 -1.878149
H  5.024875 -2.258391 0.875062
H  3.926031 -1.260335 1.817696
H  5.04002 -0.508569 0.663423
H  2.518804 2.062007 -0.505673
H  -2.199456 2.557362 0.837342
H  1.413788 4.237266 -0.747418
H  -0.959006 4.498617 -0.079077
H  -2.572805 -2.918188 1.069128
H  -0.990011 -2.444165 1.522233
H  -0.830618 0.734871 -2.1140
H  -2.268079 -0.231564 -2.508163
H  -0.64914 -0.810702 -2.964628
totalener: -1524.21922399 hartree
nucrepener: 1734.87056916 hartree
electener: -3259.08979315 hartree
oneelecener: -5542.90721322 hartree
twoeener: 2283.81742008 hartree
kineticenergy: 1519.46205579 hartree
xcener: -110.328406137093 hartree
chargesum: -0.0000000
charge: -0.398041 0.630549 -0.278851 -0.312737 -0.326190 -0.398383 -0.308225 0.134665 -0.036437 0.133238 0.495172 -0.227810 -0.254376 -0.173160 -0.108801 -0.120669 -0.107955 -0.105122 0.064651 0.080387 0.092521 0.081541 0.084983 0.104350 0.081983 0.123066 0.132722 0.128089 0.131746 0.152768 0.173424 0.100799 0.117522 0.112582
qa: -0.3980 0.6305 -0.2789 -0.3127 -0.3262 -0.3984 -0.3082 0.1347 -0.0364 0.1332 0.4952 -0.2278 -0.2544 -0.1732 -0.1088 -0.1207 -0.1080 -0.1051 0.0647 0.0804 0.0925 0.0815 0.0850 0.1044 0.0820 0.1231 0.1327 0.1281 0.1317 0.1528 0.1734 0.1008 0.1175 0.1126
va: 2.0696 5.5030 2.1195 2.1199 2.0336 2.0967 3.1731 3.8475 3.5551 3.9537 4.0839 3.9322 3.9193 4.0543 4.0081 3.9406 3.9561 3.8553 1.0256 1.0082 1.0103 1.0087 1.0090 1.0148 1.0087 1.0314 1.0155 1.0016 0.9981 1.0362 1.0337 0.9798 1.0174 0.9910
dispcorr: -0.017693378 hartree
energy: -1524.236917368428
dipole: 23.81605 -22.04804 1.76801 -2.88582 2.84738 -0.03845 -8.25712 7.46164 -0.79547
magnitude: 1.93910 au
magnitude: 4.92880 debye
