program: Orca
programVersion: 5.0.4
elementType: S P O O O O N C C C C C C C C C C C H H H H H H H H H H H H H H H H
charge: 0
multiplicity: 1
keywords: wb97x-d3
keywords: def2-TZVPP
keywords: def2/J RIJCOSX
keywords: DEFGRID2
keywords: scfconv7
keywords: smallprint printgap noloewdin
keywords: NOSOSCF
formula: C11H16NO4PS
InChI: InChI=1/C11H16NO4PS/c1-8(2)15-11(13)9-6-4-5-7-10(9)16-17(12,18)14-3/h4-8H,12H2,1-3H3
34 atoms
S  -3.92404 -0.287264 0.704714
P  -2.126301 -0.792429 0.269342
O  2.997659 -0.059673 -0.087376
O  -0.948971 -0.034172 1.099834
O  -1.619844 -0.451633 -1.214361
O  1.173633 -1.336474 0.04466
N  -1.812473 -2.392885 0.501309
C  3.846545 -1.205342 -0.27225
C  0.972371 1.04956 0.192828
C  -0.337479 1.103112 0.675475
C  1.687393 -0.247231 0.047293
C  3.835565 -1.639786 -1.726519
C  5.224962 -0.787855 0.19808
C  1.593092 2.249553 -0.159772
C  -1.005458 2.312789 0.796117
C  0.927686 3.456512 -0.055111
C  -0.373425 3.486324 0.426243
C  -2.433971 -0.784058 -2.327464
H  3.477816 -2.02161 0.353914
H  4.501772 -2.492334 -1.862078
H  2.841364 -1.94395 -2.049654
H  4.184372 -0.836988 -2.377678
H  5.621281 0.030152 -0.404869
H  5.913919 -1.628291 0.114972
H  5.210372 -0.469565 1.240223
H  2.607614 2.234995 -0.530193
H  -2.0160 2.317945 1.183317
H  1.425409 4.372402 -0.342617
H  -0.89946 4.427323 0.517544
H  -0.846731 -2.689384 0.489757
H  -2.401833 -2.884605 1.151029
H  -2.516988 -1.866345 -2.445733
H  -1.951543 -0.365251 -3.208191
H  -3.434569 -0.359099 -2.226547
totalener: -1524.22198871 hartree
nucrepener: 1703.11932610 hartree
electener: -3227.34131481 hartree
oneelecener: -5479.69429811 hartree
twoeener: 2252.35298331 hartree
kineticenergy: 1519.46489726 hartree
xcener: -110.328019712747 hartree
chargesum: -0.0000000
charge: -0.399281 0.633161 -0.278090 -0.331024 -0.294382 -0.422787 -0.330538 0.133058 -0.022541 0.175535 0.506273 -0.257906 -0.226465 -0.171930 -0.119634 -0.126067 -0.108590 -0.121904 0.063203 0.084212 0.102493 0.083084 0.081220 0.080355 0.094177 0.124219 0.129379 0.126353 0.131085 0.178112 0.161267 0.106343 0.109481 0.108132
qa: -0.3993 0.6332 -0.2781 -0.3310 -0.2944 -0.4228 -0.3305 0.1331 -0.0225 0.1755 0.5063 -0.2579 -0.2265 -0.1719 -0.1196 -0.1261 -0.1086 -0.1219 0.0632 0.0842 0.1025 0.0831 0.0812 0.0804 0.0942 0.1242 0.1294 0.1264 0.1311 0.1781 0.1613 0.1063 0.1095 0.1081
va: 2.0748 5.4955 2.1369 2.1164 2.0666 2.0622 3.1246 3.8515 3.6862 3.9951 4.0638 3.9157 3.9277 4.0452 4.0130 3.9451 3.9751 3.8753 1.0239 1.0088 1.0171 1.0084 1.0085 1.0083 1.0110 1.0287 1.0218 1.0019 0.9984 1.0322 1.0313 0.9940 0.9905 1.0059
dispcorr: -0.016063548 hartree
energy: -1524.238052253227
dipole: 22.50520 -20.82055 1.68465 -3.55591 3.41496 -0.14095 -9.94013 9.23652 -0.70361
magnitude: 1.83111 au
magnitude: 4.65432 debye
